Quantcast

Pharo 1.3 - Build # 15 - Still Unstable!

classic Classic list List threaded Threaded
19 messages Options
Reply | Threaded
Open this post in threaded view
|  
Report Content as Inappropriate

Pharo 1.3 - Build # 15 - Still Unstable!

jenkins-pharo.ci.inria.fr
BUILD UNSTABLE
Build URLhttps://ci.lille.inria.fr/pharo/job/Pharo%201.3/15/
Project:Pharo 1.3
Date of build:Thu, 23 Feb 2012 16:24:33 +0100
Build duration:42 mn

CHANGES
No Changes

BUILD ARTIFACTS
  • Pharo-1.3/Pharo-1.3.st
  • Pharo-1.3.changes
  • Pharo-1.3.image
  • Pharo-1.3.zip

  • JUnit Tests
    Name: AST.Tests.Core Failed: 0 test(s), Passed: 69 test(s), Skipped: 0 test(s), Total: 69 test(s)
    Name: AST.Tests.Semantic Failed: 0 test(s), Passed: 25 test(s), Skipped: 0 test(s), Total: 25 test(s)
    Name: Announcements.Tests.Core Failed: 0 test(s), Passed: 27 test(s), Skipped: 0 test(s), Total: 27 test(s)
    Name: AutomaticMethodCategorizer.Tests Failed: 0 test(s), Passed: 14 test(s), Skipped: 0 test(s), Total: 14 test(s)
    Name: AutomaticMethodCategorizerOB.Tests Failed: 0 test(s), Passed: 2 test(s), Skipped: 0 test(s), Total: 2 test(s)
    Name: Autotest.Tests.Core Failed: 0 test(s), Passed: 27 test(s), Skipped: 0 test(s), Total: 27 test(s)
    Name: Autotest.Tests.GUI Failed: 0 test(s), Passed: 1 test(s), Skipped: 0 test(s), Total: 1 test(s)
    Name: Balloon.Collections.Tests Failed: 0 test(s), Passed: 34 test(s), Skipped: 0 test(s), Total: 34 test(s)
    Name: CollectionsTests.Arrayed Failed: 0 test(s), Passed: 562 test(s), Skipped: 0 test(s), Total: 562 test(s)
    Name: CollectionsTests.Atomic Failed: 0 test(s), Passed: 12 test(s), Skipped: 0 test(s), Total: 12 test(s)
    Name: CollectionsTests.Sequenceable Failed: 0 test(s), Passed: 912 test(s), Skipped: 0 test(s), Total: 912 test(s)
    Name: CollectionsTests.SplitJoin Failed: 0 test(s), Passed: 27 test(s), Skipped: 0 test(s), Total: 27 test(s)
    Name: CollectionsTests.Stack Failed: 0 test(s), Passed: 16 test(s), Skipped: 0 test(s), Total: 16 test(s)
    Name: CollectionsTests.Streams Failed: 0 test(s), Passed: 25 test(s), Skipped: 0 test(s), Total: 25 test(s)
    Name: CollectionsTests.Strings Failed: 0 test(s), Passed: 590 test(s), Skipped: 0 test(s), Total: 590 test(s)
    Name: CollectionsTests.Support Failed: 0 test(s), Passed: 12 test(s), Skipped: 0 test(s), Total: 12 test(s)
    Name: CollectionsTests.Text Failed: 0 test(s), Passed: 40 test(s), Skipped: 0 test(s), Total: 40 test(s)
    Name: CollectionsTests.Unordered Failed: 0 test(s), Passed: 1977 test(s), Skipped: 0 test(s), Total: 1977 test(s)
    Name: CollectionsTests.Weak Failed: 0 test(s), Passed: 751 test(s), Skipped: 0 test(s), Total: 751 test(s)
    Name: CompilerTests Failed: 0 test(s), Passed: 30 test(s), Skipped: 0 test(s), Total: 30 test(s)
    Name: CompressionTests.Archive Failed: 0 test(s), Passed: 2 test(s), Skipped: 0 test(s), Total: 2 test(s)
    Name: Finder.Tests Failed: 0 test(s), Passed: 9 test(s), Skipped: 0 test(s), Total: 9 test(s)
    Name: FreeTypeTests.cache Failed: 0 test(s), Passed: 23 test(s), Skipped: 0 test(s), Total: 23 test(s)
    Name: Gofer.Tests Failed: 1 test(s), Passed: 44 test(s), Skipped: 0 test(s), Total: 45 test(s)
  • Failed: Gofer.Tests.GoferApiTest.testRepositoryErrors
  • Name: Graphics.Tests.Files Failed: 0 test(s), Passed: 47 test(s), Skipped: 0 test(s), Total: 47 test(s)
    Name: Graphics.Tests.Primitives Failed: 0 test(s), Passed: 57 test(s), Skipped: 0 test(s), Total: 57 test(s)
    Name: Graphics.Tests.Text Failed: 0 test(s), Passed: 2 test(s), Skipped: 0 test(s), Total: 2 test(s)
    Name: HelpSystem.Tests.Builders Failed: 0 test(s), Passed: 5 test(s), Skipped: 0 test(s), Total: 5 test(s)
    Name: HelpSystem.Tests.Core.Model Failed: 0 test(s), Passed: 4 test(s), Skipped: 0 test(s), Total: 4 test(s)
    Name: HelpSystem.Tests.Core.UI Failed: 0 test(s), Passed: 6 test(s), Skipped: 0 test(s), Total: 6 test(s)
    Name: HelpSystem.Tests.Core.Utilities Failed: 0 test(s), Passed: 2 test(s), Skipped: 0 test(s), Total: 2 test(s)
    Name: KernelTests.Chronology Failed: 0 test(s), Passed: 575 test(s), Skipped: 0 test(s), Total: 575 test(s)
    Name: KernelTests.Classes Failed: 0 test(s), Passed: 60 test(s), Skipped: 0 test(s), Total: 60 test(s)
    Name: KernelTests.Exception Failed: 0 test(s), Passed: 2 test(s), Skipped: 0 test(s), Total: 2 test(s)
    Name: KernelTests.Methods Failed: 0 test(s), Passed: 188 test(s), Skipped: 0 test(s), Total: 188 test(s)
    Name: KernelTests.Numbers Failed: 0 test(s), Passed: 220 test(s), Skipped: 0 test(s), Total: 220 test(s)
    Name: KernelTests.Objects Failed: 0 test(s), Passed: 84 test(s), Skipped: 0 test(s), Total: 84 test(s)
    Name: KernelTests.Pragmas Failed: 0 test(s), Passed: 3 test(s), Skipped: 0 test(s), Total: 3 test(s)
    Name: KernelTests.Processes Failed: 0 test(s), Passed: 22 test(s), Skipped: 0 test(s), Total: 22 test(s)
    Name: LED.Test Failed: 0 test(s), Passed: 2 test(s), Skipped: 0 test(s), Total: 2 test(s)
    Name: Metacello.TestsCore Failed: 0 test(s), Passed: 44 test(s), Skipped: 0 test(s), Total: 44 test(s)
    Name: Metacello.TestsMC Failed: 0 test(s), Passed: 303 test(s), Skipped: 0 test(s), Total: 303 test(s)
    Name: Metacello.TestsPlatform Failed: 0 test(s), Passed: 1 test(s), Skipped: 0 test(s), Total: 1 test(s)
    Name: Metacello.TestsProfStef Failed: 0 test(s), Passed: 1 test(s), Skipped: 0 test(s), Total: 1 test(s)
    Name: Metacello.TestsReference Failed: 0 test(s), Passed: 2 test(s), Skipped: 0 test(s), Total: 2 test(s)
    Name: Metacello.TestsTutorial Failed: 0 test(s), Passed: 32 test(s), Skipped: 0 test(s), Total: 32 test(s)
    Name: MethodWrappers.Tests Failed: 0 test(s), Passed: 2 test(s), Skipped: 0 test(s), Total: 2 test(s)
    Name: MorphicTests.Basic Failed: 0 test(s), Passed: 16 test(s), Skipped: 0 test(s), Total: 16 test(s)
    Name: MorphicTests.Kernel Failed: 0 test(s), Passed: 8 test(s), Skipped: 0 test(s), Total: 8 test(s)
    Name: MorphicTests.Text Support Failed: 0 test(s), Passed: 14 test(s), Skipped: 0 test(s), Total: 14 test(s)
    Name: MorphicTests.Widgets Failed: 0 test(s), Passed: 5 test(s), Skipped: 0 test(s), Total: 5 test(s)
    Name: MorphicTests.WindowNotification Failed: 0 test(s), Passed: 7 test(s), Skipped: 0 test(s), Total: 7 test(s)
    Name: Multilingual.Tests.TextConversion Failed: 0 test(s), Passed: 7 test(s), Skipped: 0 test(s), Total: 7 test(s)
    Name: NetworkTests.Kernel Failed: 0 test(s), Passed: 31 test(s), Skipped: 0 test(s), Total: 31 test(s)
    Name: NetworkTests.MailMessage Failed: 0 test(s), Passed: 2 test(s), Skipped: 0 test(s), Total: 2 test(s)
    Name: NetworkTests.Protocols Failed: 0 test(s), Passed: 3 test(s), Skipped: 0 test(s), Total: 3 test(s)
    Name: NetworkTests.RFC822 Failed: 0 test(s), Passed: 1 test(s), Skipped: 0 test(s), Total: 1 test(s)
    Name: NetworkTests.URI Failed: 0 test(s), Passed: 105 test(s), Skipped: 0 test(s), Total: 105 test(s)
    Name: NetworkTests.UUID Failed: 0 test(s), Passed: 11 test(s), Skipped: 0 test(s), Total: 11 test(s)
    Name: NetworkTests.Url Failed: 0 test(s), Passed: 42 test(s), Skipped: 0 test(s), Total: 42 test(s)
    Name: OB.Fake.Tests Failed: 0 test(s), Passed: 10 test(s), Skipped: 0 test(s), Total: 10 test(s)
    Name: OB.Tests.Core Failed: 0 test(s), Passed: 89 test(s), Skipped: 0 test(s), Total: 89 test(s)
    Name: OB.Tests.Morphic Failed: 0 test(s), Passed: 24 test(s), Skipped: 0 test(s), Total: 24 test(s)
    Name: OB.Tests.Standard Failed: 0 test(s), Passed: 647 test(s), Skipped: 0 test(s), Total: 647 test(s)
    Name: OcompletionTests Failed: 14 test(s), Passed: 64 test(s), Skipped: 0 test(s), Total: 78 test(s)
  • Failed: OcompletionTests.ECInstVarTypeGuesserTest.testComplexInit
  • Failed: OcompletionTests.ECInstVarTypeGuesserTest.testComplexInit2
  • Failed: OcompletionTests.ECInstVarTypeGuesserTest.testConstantArray
  • Failed: OcompletionTests.ECInstVarTypeGuesserTest.testConstantBoolean
  • Failed: OcompletionTests.ECInstVarTypeGuesserTest.testConstantInteger
  • Failed: OcompletionTests.ECInstVarTypeGuesserTest.testConstantIntegerNil
  • Failed: OcompletionTests.ECInstVarTypeGuesserTest.testConstantString
  • Failed: OcompletionTests.ECInstVarTypeGuesserTest.testConstantSymbol
  • Failed: OcompletionTests.ECInstVarTypeGuesserTest.testGlobalVarKeyword
  • Failed: OcompletionTests.ECInstVarTypeGuesserTest.testGlobalVarKeyword2
  • Failed: OcompletionTests.ECInstVarTypeGuesserTest.testMessageSend
  • Failed: OcompletionTests.ECInstVarTypeGuesserTest.testMessageSend2
  • Failed: OcompletionTests.ECInstVarTypeGuesserTest.testSuperWithAnotherInit
  • Failed: OcompletionTests.ECInstVarTypeGuesserTest.testTypeSuggestingParameter
  • Name: ProfStef.Tests Failed: 0 test(s), Passed: 47 test(s), Skipped: 0 test(s), Total: 47 test(s)
    Name: Refactoring.Tests.Changes Failed: 0 test(s), Passed: 43 test(s), Skipped: 0 test(s), Total: 43 test(s)
    Name: Refactoring.Tests.Core Failed: 0 test(s), Passed: 215 test(s), Skipped: 0 test(s), Total: 215 test(s)
    Name: Refactoring.Tests.Critics Failed: 0 test(s), Passed: 57 test(s), Skipped: 0 test(s), Total: 57 test(s)
    Name: Refactoring.Tests.Environment Failed: 0 test(s), Passed: 20 test(s), Skipped: 0 test(s), Total: 20 test(s)
    Name: Refactoring.Tests.Spelling Failed: 0 test(s), Passed: 16 test(s), Skipped: 0 test(s), Total: 16 test(s)
    Name: Regex.Tests.Core Failed: 0 test(s), Passed: 188 test(s), Skipped: 0 test(s), Total: 188 test(s)
    Name: RoelTyper.Tests Failed: 0 test(s), Passed: 72 test(s), Skipped: 0 test(s), Total: 72 test(s)
    Name: SUnit.Core.Extensions Failed: 0 test(s), Passed: 3 test(s), Skipped: 0 test(s), Total: 3 test(s)
    Name: SUnit.Core.Utilities Failed: 0 test(s), Passed: 3 test(s), Skipped: 0 test(s), Total: 3 test(s)
    Name: SUnit.Tests.Core Failed: 0 test(s), Passed: 77 test(s), Skipped: 0 test(s), Total: 77 test(s)
    Name: ShoutTests.Parsing Failed: 0 test(s), Passed: 5 test(s), Skipped: 0 test(s), Total: 5 test(s)
    Name: StratifiedProxy.Tests Failed: 0 test(s), Passed: 2 test(s), Skipped: 0 test(s), Total: 2 test(s)
    Name: Tests.Browser Failed: 0 test(s), Passed: 7 test(s), Skipped: 0 test(s), Total: 7 test(s)
    Name: Tests.Bugs Failed: 0 test(s), Passed: 60 test(s), Skipped: 0 test(s), Total: 60 test(s)
    Name: Tests.Compiler Failed: 0 test(s), Passed: 71 test(s), Skipped: 0 test(s), Total: 71 test(s)
    Name: Tests.Compression Failed: 0 test(s), Passed: 9 test(s), Skipped: 0 test(s), Total: 9 test(s)
    Name: Tests.Digital Signatures Failed: 0 test(s), Passed: 8 test(s), Skipped: 0 test(s), Total: 8 test(s)
    Name: Tests.Exceptions Failed: 0 test(s), Passed: 28 test(s), Skipped: 0 test(s), Total: 28 test(s)
    Name: Tests.Files Failed: 0 test(s), Passed: 55 test(s), Skipped: 0 test(s), Total: 55 test(s)
    Name: Tests.Finalization Failed: 0 test(s), Passed: 1 test(s), Skipped: 0 test(s), Total: 1 test(s)
    Name: Tests.Localization Failed: 0 test(s), Passed: 1 test(s), Skipped: 0 test(s), Total: 1 test(s)
    Name: Tests.Monticello Failed: 0 test(s), Passed: 120 test(s), Skipped: 0 test(s), Total: 120 test(s)
    Name: Tests.Multilingual Failed: 0 test(s), Passed: 3 test(s), Skipped: 0 test(s), Total: 3 test(s)
    Name: Tests.Object Events Failed: 0 test(s), Passed: 24 test(s), Skipped: 0 test(s), Total: 24 test(s)
    Name: Tests.ObjectsAsMethods Failed: 0 test(s), Passed: 3 test(s), Skipped: 0 test(s), Total: 3 test(s)
    Name: Tests.PackageInfo Failed: 0 test(s), Passed: 1 test(s), Skipped: 0 test(s), Total: 1 test(s)
    Name: Tests.Polymorph.Widgets Failed: 0 test(s), Passed: 9 test(s), Skipped: 0 test(s), Total: 9 test(s)
    Name: Tests.Release Failed: 1 test(s), Passed: 2 test(s), Skipped: 0 test(s), Total: 3 test(s)
  • Failed: Tests.Release.ReleaseTest.testUndeclared
  • Name: Tests.ScriptLoader Failed: 0 test(s), Passed: 4 test(s), Skipped: 0 test(s), Total: 4 test(s)
    Name: Tests.System Failed: 0 test(s), Passed: 298 test(s), Skipped: 0 test(s), Total: 298 test(s)
    Name: Tests.SystemChangeNotification Failed: 0 test(s), Passed: 37 test(s), Skipped: 0 test(s), Total: 37 test(s)
    Name: Tests.SystemHistory Failed: 0 test(s), Passed: 14 test(s), Skipped: 0 test(s), Total: 14 test(s)
    Name: Tests.SystemSupport Failed: 0 test(s), Passed: 9 test(s), Skipped: 0 test(s), Total: 9 test(s)
    Name: Tests.TextEditors Failed: 0 test(s), Passed: 7 test(s), Skipped: 0 test(s), Total: 7 test(s)
    Name: Tests.Traits Failed: 0 test(s), Passed: 60 test(s), Skipped: 0 test(s), Total: 60 test(s)
    Name: Tests.Traits.MOP Failed: 0 test(s), Passed: 3 test(s), Skipped: 0 test(s), Total: 3 test(s)
    Name: Tests.VM Failed: 0 test(s), Passed: 10 test(s), Skipped: 0 test(s), Total: 10 test(s)
    Name: ToolsTest.Debugger Failed: 0 test(s), Passed: 10 test(s), Skipped: 0 test(s), Total: 10 test(s)
    Name: ToolsTest.Inspector Failed: 0 test(s), Passed: 1 test(s), Skipped: 0 test(s), Total: 1 test(s)
    Name: ToolsTest.MessageTally Failed: 0 test(s), Passed: 5 test(s), Skipped: 0 test(s), Total: 5 test(s)
    Name: ToolsTest.PointerFinder Failed: 0 test(s), Passed: 3 test(s), Skipped: 0 test(s), Total: 3 test(s)
    Name: Zinc.Tests Failed: 0 test(s), Passed: 201 test(s), Skipped: 0 test(s), Total: 201 test(s)

    Reply | Threaded
    Open this post in threaded view
    |  
    Report Content as Inappropriate

    Pharo 1.3 - Build # 16 - Still Unstable!

    jenkins-pharo.ci.inria.fr
    BUILD UNSTABLE
    Build URLhttps://ci.lille.inria.fr/pharo/job/Pharo%201.3/16/
    Project:Pharo 1.3
    Date of build:Thu, 23 Feb 2012 20:41:19 +0100
    Build duration:42 mn

    CHANGES
    No Changes

    BUILD ARTIFACTS
  • Pharo-1.3/Pharo-1.3.st
  • Pharo-1.3.changes
  • Pharo-1.3.image
  • Pharo-1.3.zip

  • JUnit Tests
    Name: AST.Tests.Core Failed: 0 test(s), Passed: 69 test(s), Skipped: 0 test(s), Total: 69 test(s)
    Name: AST.Tests.Semantic Failed: 0 test(s), Passed: 25 test(s), Skipped: 0 test(s), Total: 25 test(s)
    Name: Announcements.Tests.Core Failed: 0 test(s), Passed: 27 test(s), Skipped: 0 test(s), Total: 27 test(s)
    Name: AutomaticMethodCategorizer.Tests Failed: 0 test(s), Passed: 14 test(s), Skipped: 0 test(s), Total: 14 test(s)
    Name: AutomaticMethodCategorizerOB.Tests Failed: 0 test(s), Passed: 2 test(s), Skipped: 0 test(s), Total: 2 test(s)
    Name: Autotest.Tests.Core Failed: 0 test(s), Passed: 27 test(s), Skipped: 0 test(s), Total: 27 test(s)
    Name: Autotest.Tests.GUI Failed: 0 test(s), Passed: 1 test(s), Skipped: 0 test(s), Total: 1 test(s)
    Name: Balloon.Collections.Tests Failed: 0 test(s), Passed: 34 test(s), Skipped: 0 test(s), Total: 34 test(s)
    Name: CollectionsTests.Arrayed Failed: 0 test(s), Passed: 562 test(s), Skipped: 0 test(s), Total: 562 test(s)
    Name: CollectionsTests.Atomic Failed: 0 test(s), Passed: 12 test(s), Skipped: 0 test(s), Total: 12 test(s)
    Name: CollectionsTests.Sequenceable Failed: 0 test(s), Passed: 912 test(s), Skipped: 0 test(s), Total: 912 test(s)
    Name: CollectionsTests.SplitJoin Failed: 0 test(s), Passed: 27 test(s), Skipped: 0 test(s), Total: 27 test(s)
    Name: CollectionsTests.Stack Failed: 0 test(s), Passed: 16 test(s), Skipped: 0 test(s), Total: 16 test(s)
    Name: CollectionsTests.Streams Failed: 0 test(s), Passed: 25 test(s), Skipped: 0 test(s), Total: 25 test(s)
    Name: CollectionsTests.Strings Failed: 0 test(s), Passed: 590 test(s), Skipped: 0 test(s), Total: 590 test(s)
    Name: CollectionsTests.Support Failed: 0 test(s), Passed: 12 test(s), Skipped: 0 test(s), Total: 12 test(s)
    Name: CollectionsTests.Text Failed: 0 test(s), Passed: 40 test(s), Skipped: 0 test(s), Total: 40 test(s)
    Name: CollectionsTests.Unordered Failed: 0 test(s), Passed: 1977 test(s), Skipped: 0 test(s), Total: 1977 test(s)
    Name: CollectionsTests.Weak Failed: 0 test(s), Passed: 751 test(s), Skipped: 0 test(s), Total: 751 test(s)
    Name: CompilerTests Failed: 0 test(s), Passed: 30 test(s), Skipped: 0 test(s), Total: 30 test(s)
    Name: CompressionTests.Archive Failed: 0 test(s), Passed: 2 test(s), Skipped: 0 test(s), Total: 2 test(s)
    Name: Finder.Tests Failed: 0 test(s), Passed: 9 test(s), Skipped: 0 test(s), Total: 9 test(s)
    Name: FreeTypeTests.cache Failed: 0 test(s), Passed: 23 test(s), Skipped: 0 test(s), Total: 23 test(s)
    Name: Gofer.Tests Failed: 0 test(s), Passed: 45 test(s), Skipped: 0 test(s), Total: 45 test(s)
    Name: Graphics.Tests.Files Failed: 0 test(s), Passed: 47 test(s), Skipped: 0 test(s), Total: 47 test(s)
    Name: Graphics.Tests.Primitives Failed: 0 test(s), Passed: 57 test(s), Skipped: 0 test(s), Total: 57 test(s)
    Name: Graphics.Tests.Text Failed: 0 test(s), Passed: 2 test(s), Skipped: 0 test(s), Total: 2 test(s)
    Name: HelpSystem.Tests.Builders Failed: 0 test(s), Passed: 5 test(s), Skipped: 0 test(s), Total: 5 test(s)
    Name: HelpSystem.Tests.Core.Model Failed: 0 test(s), Passed: 4 test(s), Skipped: 0 test(s), Total: 4 test(s)
    Name: HelpSystem.Tests.Core.UI Failed: 0 test(s), Passed: 6 test(s), Skipped: 0 test(s), Total: 6 test(s)
    Name: HelpSystem.Tests.Core.Utilities Failed: 0 test(s), Passed: 2 test(s), Skipped: 0 test(s), Total: 2 test(s)
    Name: KernelTests.Chronology Failed: 0 test(s), Passed: 575 test(s), Skipped: 0 test(s), Total: 575 test(s)
    Name: KernelTests.Classes Failed: 0 test(s), Passed: 60 test(s), Skipped: 0 test(s), Total: 60 test(s)
    Name: KernelTests.Exception Failed: 0 test(s), Passed: 2 test(s), Skipped: 0 test(s), Total: 2 test(s)
    Name: KernelTests.Methods Failed: 0 test(s), Passed: 188 test(s), Skipped: 0 test(s), Total: 188 test(s)
    Name: KernelTests.Numbers Failed: 0 test(s), Passed: 220 test(s), Skipped: 0 test(s), Total: 220 test(s)
    Name: KernelTests.Objects Failed: 0 test(s), Passed: 84 test(s), Skipped: 0 test(s), Total: 84 test(s)
    Name: KernelTests.Pragmas Failed: 0 test(s), Passed: 3 test(s), Skipped: 0 test(s), Total: 3 test(s)
    Name: KernelTests.Processes Failed: 0 test(s), Passed: 22 test(s), Skipped: 0 test(s), Total: 22 test(s)
    Name: LED.Test Failed: 0 test(s), Passed: 2 test(s), Skipped: 0 test(s), Total: 2 test(s)
    Name: Metacello.TestsCore Failed: 0 test(s), Passed: 44 test(s), Skipped: 0 test(s), Total: 44 test(s)
    Name: Metacello.TestsMC Failed: 0 test(s), Passed: 303 test(s), Skipped: 0 test(s), Total: 303 test(s)
    Name: Metacello.TestsPlatform Failed: 0 test(s), Passed: 1 test(s), Skipped: 0 test(s), Total: 1 test(s)
    Name: Metacello.TestsProfStef Failed: 0 test(s), Passed: 1 test(s), Skipped: 0 test(s), Total: 1 test(s)
    Name: Metacello.TestsReference Failed: 0 test(s), Passed: 2 test(s), Skipped: 0 test(s), Total: 2 test(s)
    Name: Metacello.TestsTutorial Failed: 0 test(s), Passed: 32 test(s), Skipped: 0 test(s), Total: 32 test(s)
    Name: MethodWrappers.Tests Failed: 0 test(s), Passed: 2 test(s), Skipped: 0 test(s), Total: 2 test(s)
    Name: MorphicTests.Basic Failed: 0 test(s), Passed: 16 test(s), Skipped: 0 test(s), Total: 16 test(s)
    Name: MorphicTests.Kernel Failed: 0 test(s), Passed: 8 test(s), Skipped: 0 test(s), Total: 8 test(s)
    Name: MorphicTests.Text Support Failed: 0 test(s), Passed: 14 test(s), Skipped: 0 test(s), Total: 14 test(s)
    Name: MorphicTests.Widgets Failed: 0 test(s), Passed: 5 test(s), Skipped: 0 test(s), Total: 5 test(s)
    Name: MorphicTests.WindowNotification Failed: 0 test(s), Passed: 7 test(s), Skipped: 0 test(s), Total: 7 test(s)
    Name: Multilingual.Tests.TextConversion Failed: 0 test(s), Passed: 7 test(s), Skipped: 0 test(s), Total: 7 test(s)
    Name: NetworkTests.Kernel Failed: 0 test(s), Passed: 31 test(s), Skipped: 0 test(s), Total: 31 test(s)
    Name: NetworkTests.MailMessage Failed: 0 test(s), Passed: 2 test(s), Skipped: 0 test(s), Total: 2 test(s)
    Name: NetworkTests.Protocols Failed: 0 test(s), Passed: 3 test(s), Skipped: 0 test(s), Total: 3 test(s)
    Name: NetworkTests.RFC822 Failed: 0 test(s), Passed: 1 test(s), Skipped: 0 test(s), Total: 1 test(s)
    Name: NetworkTests.URI Failed: 0 test(s), Passed: 105 test(s), Skipped: 0 test(s), Total: 105 test(s)
    Name: NetworkTests.UUID Failed: 0 test(s), Passed: 11 test(s), Skipped: 0 test(s), Total: 11 test(s)
    Name: NetworkTests.Url Failed: 0 test(s), Passed: 42 test(s), Skipped: 0 test(s), Total: 42 test(s)
    Name: OB.Fake.Tests Failed: 0 test(s), Passed: 10 test(s), Skipped: 0 test(s), Total: 10 test(s)
    Name: OB.Tests.Core Failed: 0 test(s), Passed: 89 test(s), Skipped: 0 test(s), Total: 89 test(s)
    Name: OB.Tests.Morphic Failed: 0 test(s), Passed: 24 test(s), Skipped: 0 test(s), Total: 24 test(s)
    Name: OB.Tests.Standard Failed: 0 test(s), Passed: 647 test(s), Skipped: 0 test(s), Total: 647 test(s)
    Name: OcompletionTests Failed: 14 test(s), Passed: 64 test(s), Skipped: 0 test(s), Total: 78 test(s)
  • Failed: OcompletionTests.ECInstVarTypeGuesserTest.testComplexInit
  • Failed: OcompletionTests.ECInstVarTypeGuesserTest.testComplexInit2
  • Failed: OcompletionTests.ECInstVarTypeGuesserTest.testConstantArray
  • Failed: OcompletionTests.ECInstVarTypeGuesserTest.testConstantBoolean
  • Failed: OcompletionTests.ECInstVarTypeGuesserTest.testConstantInteger
  • Failed: OcompletionTests.ECInstVarTypeGuesserTest.testConstantIntegerNil
  • Failed: OcompletionTests.ECInstVarTypeGuesserTest.testConstantString
  • Failed: OcompletionTests.ECInstVarTypeGuesserTest.testConstantSymbol
  • Failed: OcompletionTests.ECInstVarTypeGuesserTest.testGlobalVarKeyword
  • Failed: OcompletionTests.ECInstVarTypeGuesserTest.testGlobalVarKeyword2
  • Failed: OcompletionTests.ECInstVarTypeGuesserTest.testMessageSend
  • Failed: OcompletionTests.ECInstVarTypeGuesserTest.testMessageSend2
  • Failed: OcompletionTests.ECInstVarTypeGuesserTest.testSuperWithAnotherInit
  • Failed: OcompletionTests.ECInstVarTypeGuesserTest.testTypeSuggestingParameter
  • Name: ProfStef.Tests Failed: 0 test(s), Passed: 47 test(s), Skipped: 0 test(s), Total: 47 test(s)
    Name: Refactoring.Tests.Changes Failed: 0 test(s), Passed: 43 test(s), Skipped: 0 test(s), Total: 43 test(s)
    Name: Refactoring.Tests.Core Failed: 0 test(s), Passed: 215 test(s), Skipped: 0 test(s), Total: 215 test(s)
    Name: Refactoring.Tests.Critics Failed: 0 test(s), Passed: 57 test(s), Skipped: 0 test(s), Total: 57 test(s)
    Name: Refactoring.Tests.Environment Failed: 0 test(s), Passed: 20 test(s), Skipped: 0 test(s), Total: 20 test(s)
    Name: Refactoring.Tests.Spelling Failed: 0 test(s), Passed: 16 test(s), Skipped: 0 test(s), Total: 16 test(s)
    Name: Regex.Tests.Core Failed: 0 test(s), Passed: 188 test(s), Skipped: 0 test(s), Total: 188 test(s)
    Name: RoelTyper.Tests Failed: 0 test(s), Passed: 72 test(s), Skipped: 0 test(s), Total: 72 test(s)
    Name: SUnit.Core.Extensions Failed: 0 test(s), Passed: 3 test(s), Skipped: 0 test(s), Total: 3 test(s)
    Name: SUnit.Core.Utilities Failed: 0 test(s), Passed: 3 test(s), Skipped: 0 test(s), Total: 3 test(s)
    Name: SUnit.Tests.Core Failed: 0 test(s), Passed: 77 test(s), Skipped: 0 test(s), Total: 77 test(s)
    Name: ShoutTests.Parsing Failed: 0 test(s), Passed: 5 test(s), Skipped: 0 test(s), Total: 5 test(s)
    Name: StratifiedProxy.Tests Failed: 0 test(s), Passed: 2 test(s), Skipped: 0 test(s), Total: 2 test(s)
    Name: Tests.Browser Failed: 0 test(s), Passed: 7 test(s), Skipped: 0 test(s), Total: 7 test(s)
    Name: Tests.Bugs Failed: 0 test(s), Passed: 60 test(s), Skipped: 0 test(s), Total: 60 test(s)
    Name: Tests.Compiler Failed: 0 test(s), Passed: 71 test(s), Skipped: 0 test(s), Total: 71 test(s)
    Name: Tests.Compression Failed: 0 test(s), Passed: 9 test(s), Skipped: 0 test(s), Total: 9 test(s)
    Name: Tests.Digital Signatures Failed: 0 test(s), Passed: 8 test(s), Skipped: 0 test(s), Total: 8 test(s)
    Name: Tests.Exceptions Failed: 0 test(s), Passed: 28 test(s), Skipped: 0 test(s), Total: 28 test(s)
    Name: Tests.Files Failed: 0 test(s), Passed: 55 test(s), Skipped: 0 test(s), Total: 55 test(s)
    Name: Tests.Finalization Failed: 0 test(s), Passed: 1 test(s), Skipped: 0 test(s), Total: 1 test(s)
    Name: Tests.Localization Failed: 0 test(s), Passed: 1 test(s), Skipped: 0 test(s), Total: 1 test(s)
    Name: Tests.Monticello Failed: 0 test(s), Passed: 120 test(s), Skipped: 0 test(s), Total: 120 test(s)
    Name: Tests.Multilingual Failed: 0 test(s), Passed: 3 test(s), Skipped: 0 test(s), Total: 3 test(s)
    Name: Tests.Object Events Failed: 0 test(s), Passed: 24 test(s), Skipped: 0 test(s), Total: 24 test(s)
    Name: Tests.ObjectsAsMethods Failed: 0 test(s), Passed: 3 test(s), Skipped: 0 test(s), Total: 3 test(s)
    Name: Tests.PackageInfo Failed: 0 test(s), Passed: 1 test(s), Skipped: 0 test(s), Total: 1 test(s)
    Name: Tests.Polymorph.Widgets Failed: 0 test(s), Passed: 9 test(s), Skipped: 0 test(s), Total: 9 test(s)
    Name: Tests.Release Failed: 1 test(s), Passed: 2 test(s), Skipped: 0 test(s), Total: 3 test(s)
  • Failed: Tests.Release.ReleaseTest.testUndeclared
  • Name: Tests.ScriptLoader Failed: 0 test(s), Passed: 4 test(s), Skipped: 0 test(s), Total: 4 test(s)
    Name: Tests.System Failed: 0 test(s), Passed: 298 test(s), Skipped: 0 test(s), Total: 298 test(s)
    Name: Tests.SystemChangeNotification Failed: 0 test(s), Passed: 37 test(s), Skipped: 0 test(s), Total: 37 test(s)
    Name: Tests.SystemHistory Failed: 0 test(s), Passed: 14 test(s), Skipped: 0 test(s), Total: 14 test(s)
    Name: Tests.SystemSupport Failed: 0 test(s), Passed: 9 test(s), Skipped: 0 test(s), Total: 9 test(s)
    Name: Tests.TextEditors Failed: 0 test(s), Passed: 7 test(s), Skipped: 0 test(s), Total: 7 test(s)
    Name: Tests.Traits Failed: 0 test(s), Passed: 60 test(s), Skipped: 0 test(s), Total: 60 test(s)
    Name: Tests.Traits.MOP Failed: 0 test(s), Passed: 3 test(s), Skipped: 0 test(s), Total: 3 test(s)
    Name: Tests.VM Failed: 0 test(s), Passed: 10 test(s), Skipped: 0 test(s), Total: 10 test(s)
    Name: ToolsTest.Debugger Failed: 0 test(s), Passed: 10 test(s), Skipped: 0 test(s), Total: 10 test(s)
    Name: ToolsTest.Inspector Failed: 0 test(s), Passed: 1 test(s), Skipped: 0 test(s), Total: 1 test(s)
    Name: ToolsTest.MessageTally Failed: 0 test(s), Passed: 5 test(s), Skipped: 0 test(s), Total: 5 test(s)
    Name: ToolsTest.PointerFinder Failed: 0 test(s), Passed: 3 test(s), Skipped: 0 test(s), Total: 3 test(s)
    Name: Zinc.Tests Failed: 0 test(s), Passed: 201 test(s), Skipped: 0 test(s), Total: 201 test(s)

    Reply | Threaded
    Open this post in threaded view
    |  
    Report Content as Inappropriate

    Pharo 1.3 - Build # 17 - Still Unstable!

    jenkins-pharo.ci.inria.fr
    BUILD UNSTABLE
    Build URLhttps://ci.lille.inria.fr/pharo/job/Pharo%201.3/17/
    Project:Pharo 1.3
    Date of build:Fri, 24 Feb 2012 15:32:36 +0100
    Build duration:42 mn

    CHANGES
    No Changes

    BUILD ARTIFACTS
  • Pharo-1.3/Pharo-1.3.st
  • Pharo-1.3.changes
  • Pharo-1.3.image
  • Pharo-1.3.zip

  • JUnit Tests
    Name: AST.Tests.Core Failed: 0 test(s), Passed: 69 test(s), Skipped: 0 test(s), Total: 69 test(s)
    Name: AST.Tests.Semantic Failed: 0 test(s), Passed: 25 test(s), Skipped: 0 test(s), Total: 25 test(s)
    Name: Announcements.Tests.Core Failed: 0 test(s), Passed: 27 test(s), Skipped: 0 test(s), Total: 27 test(s)
    Name: AutomaticMethodCategorizer.Tests Failed: 0 test(s), Passed: 14 test(s), Skipped: 0 test(s), Total: 14 test(s)
    Name: AutomaticMethodCategorizerOB.Tests Failed: 0 test(s), Passed: 2 test(s), Skipped: 0 test(s), Total: 2 test(s)
    Name: Autotest.Tests.Core Failed: 0 test(s), Passed: 27 test(s), Skipped: 0 test(s), Total: 27 test(s)
    Name: Autotest.Tests.GUI Failed: 0 test(s), Passed: 1 test(s), Skipped: 0 test(s), Total: 1 test(s)
    Name: Balloon.Collections.Tests Failed: 0 test(s), Passed: 34 test(s), Skipped: 0 test(s), Total: 34 test(s)
    Name: CollectionsTests.Arrayed Failed: 0 test(s), Passed: 562 test(s), Skipped: 0 test(s), Total: 562 test(s)
    Name: CollectionsTests.Atomic Failed: 0 test(s), Passed: 12 test(s), Skipped: 0 test(s), Total: 12 test(s)
    Name: CollectionsTests.Sequenceable Failed: 0 test(s), Passed: 912 test(s), Skipped: 0 test(s), Total: 912 test(s)
    Name: CollectionsTests.SplitJoin Failed: 0 test(s), Passed: 27 test(s), Skipped: 0 test(s), Total: 27 test(s)
    Name: CollectionsTests.Stack Failed: 0 test(s), Passed: 16 test(s), Skipped: 0 test(s), Total: 16 test(s)
    Name: CollectionsTests.Streams Failed: 0 test(s), Passed: 25 test(s), Skipped: 0 test(s), Total: 25 test(s)
    Name: CollectionsTests.Strings Failed: 0 test(s), Passed: 590 test(s), Skipped: 0 test(s), Total: 590 test(s)
    Name: CollectionsTests.Support Failed: 0 test(s), Passed: 12 test(s), Skipped: 0 test(s), Total: 12 test(s)
    Name: CollectionsTests.Text Failed: 0 test(s), Passed: 40 test(s), Skipped: 0 test(s), Total: 40 test(s)
    Name: CollectionsTests.Unordered Failed: 0 test(s), Passed: 1977 test(s), Skipped: 0 test(s), Total: 1977 test(s)
    Name: CollectionsTests.Weak Failed: 0 test(s), Passed: 751 test(s), Skipped: 0 test(s), Total: 751 test(s)
    Name: CompilerTests Failed: 0 test(s), Passed: 30 test(s), Skipped: 0 test(s), Total: 30 test(s)
    Name: CompressionTests.Archive Failed: 0 test(s), Passed: 2 test(s), Skipped: 0 test(s), Total: 2 test(s)
    Name: Finder.Tests Failed: 0 test(s), Passed: 9 test(s), Skipped: 0 test(s), Total: 9 test(s)
    Name: FreeTypeTests.cache Failed: 0 test(s), Passed: 23 test(s), Skipped: 0 test(s), Total: 23 test(s)
    Name: Gofer.Tests Failed: 0 test(s), Passed: 45 test(s), Skipped: 0 test(s), Total: 45 test(s)
    Name: Graphics.Tests.Files Failed: 0 test(s), Passed: 47 test(s), Skipped: 0 test(s), Total: 47 test(s)
    Name: Graphics.Tests.Primitives Failed: 0 test(s), Passed: 57 test(s), Skipped: 0 test(s), Total: 57 test(s)
    Name: Graphics.Tests.Text Failed: 0 test(s), Passed: 2 test(s), Skipped: 0 test(s), Total: 2 test(s)
    Name: HelpSystem.Tests.Builders Failed: 0 test(s), Passed: 5 test(s), Skipped: 0 test(s), Total: 5 test(s)
    Name: HelpSystem.Tests.Core.Model Failed: 0 test(s), Passed: 4 test(s), Skipped: 0 test(s), Total: 4 test(s)
    Name: HelpSystem.Tests.Core.UI Failed: 0 test(s), Passed: 6 test(s), Skipped: 0 test(s), Total: 6 test(s)
    Name: HelpSystem.Tests.Core.Utilities Failed: 0 test(s), Passed: 2 test(s), Skipped: 0 test(s), Total: 2 test(s)
    Name: KernelTests.Chronology Failed: 0 test(s), Passed: 575 test(s), Skipped: 0 test(s), Total: 575 test(s)
    Name: KernelTests.Classes Failed: 0 test(s), Passed: 60 test(s), Skipped: 0 test(s), Total: 60 test(s)
    Name: KernelTests.Exception Failed: 0 test(s), Passed: 2 test(s), Skipped: 0 test(s), Total: 2 test(s)
    Name: KernelTests.Methods Failed: 0 test(s), Passed: 188 test(s), Skipped: 0 test(s), Total: 188 test(s)
    Name: KernelTests.Numbers Failed: 0 test(s), Passed: 220 test(s), Skipped: 0 test(s), Total: 220 test(s)
    Name: KernelTests.Objects Failed: 0 test(s), Passed: 84 test(s), Skipped: 0 test(s), Total: 84 test(s)
    Name: KernelTests.Pragmas Failed: 0 test(s), Passed: 3 test(s), Skipped: 0 test(s), Total: 3 test(s)
    Name: KernelTests.Processes Failed: 0 test(s), Passed: 22 test(s), Skipped: 0 test(s), Total: 22 test(s)
    Name: LED.Test Failed: 0 test(s), Passed: 2 test(s), Skipped: 0 test(s), Total: 2 test(s)
    Name: Metacello.TestsCore Failed: 0 test(s), Passed: 44 test(s), Skipped: 0 test(s), Total: 44 test(s)
    Name: Metacello.TestsMC Failed: 0 test(s), Passed: 303 test(s), Skipped: 0 test(s), Total: 303 test(s)
    Name: Metacello.TestsPlatform Failed: 0 test(s), Passed: 1 test(s), Skipped: 0 test(s), Total: 1 test(s)
    Name: Metacello.TestsProfStef Failed: 0 test(s), Passed: 1 test(s), Skipped: 0 test(s), Total: 1 test(s)
    Name: Metacello.TestsReference Failed: 0 test(s), Passed: 2 test(s), Skipped: 0 test(s), Total: 2 test(s)
    Name: Metacello.TestsTutorial Failed: 0 test(s), Passed: 32 test(s), Skipped: 0 test(s), Total: 32 test(s)
    Name: MethodWrappers.Tests Failed: 0 test(s), Passed: 2 test(s), Skipped: 0 test(s), Total: 2 test(s)
    Name: MorphicTests.Basic Failed: 0 test(s), Passed: 16 test(s), Skipped: 0 test(s), Total: 16 test(s)
    Name: MorphicTests.Kernel Failed: 0 test(s), Passed: 8 test(s), Skipped: 0 test(s), Total: 8 test(s)
    Name: MorphicTests.Text Support Failed: 0 test(s), Passed: 14 test(s), Skipped: 0 test(s), Total: 14 test(s)
    Name: MorphicTests.Widgets Failed: 0 test(s), Passed: 5 test(s), Skipped: 0 test(s), Total: 5 test(s)
    Name: MorphicTests.WindowNotification Failed: 0 test(s), Passed: 7 test(s), Skipped: 0 test(s), Total: 7 test(s)
    Name: Multilingual.Tests.TextConversion Failed: 0 test(s), Passed: 7 test(s), Skipped: 0 test(s), Total: 7 test(s)
    Name: NetworkTests.Kernel Failed: 0 test(s), Passed: 31 test(s), Skipped: 0 test(s), Total: 31 test(s)
    Name: NetworkTests.MailMessage Failed: 0 test(s), Passed: 2 test(s), Skipped: 0 test(s), Total: 2 test(s)
    Name: NetworkTests.Protocols Failed: 0 test(s), Passed: 3 test(s), Skipped: 0 test(s), Total: 3 test(s)
    Name: NetworkTests.RFC822 Failed: 0 test(s), Passed: 1 test(s), Skipped: 0 test(s), Total: 1 test(s)
    Name: NetworkTests.URI Failed: 0 test(s), Passed: 105 test(s), Skipped: 0 test(s), Total: 105 test(s)
    Name: NetworkTests.UUID Failed: 0 test(s), Passed: 11 test(s), Skipped: 0 test(s), Total: 11 test(s)
    Name: NetworkTests.Url Failed: 0 test(s), Passed: 42 test(s), Skipped: 0 test(s), Total: 42 test(s)
    Name: OB.Fake.Tests Failed: 0 test(s), Passed: 10 test(s), Skipped: 0 test(s), Total: 10 test(s)
    Name: OB.Tests.Core Failed: 0 test(s), Passed: 89 test(s), Skipped: 0 test(s), Total: 89 test(s)
    Name: OB.Tests.Morphic Failed: 0 test(s), Passed: 24 test(s), Skipped: 0 test(s), Total: 24 test(s)
    Name: OB.Tests.Standard Failed: 0 test(s), Passed: 647 test(s), Skipped: 0 test(s), Total: 647 test(s)
    Name: OcompletionTests Failed: 14 test(s), Passed: 64 test(s), Skipped: 0 test(s), Total: 78 test(s)
  • Failed: OcompletionTests.ECInstVarTypeGuesserTest.testComplexInit
  • Failed: OcompletionTests.ECInstVarTypeGuesserTest.testComplexInit2
  • Failed: OcompletionTests.ECInstVarTypeGuesserTest.testConstantArray
  • Failed: OcompletionTests.ECInstVarTypeGuesserTest.testConstantBoolean
  • Failed: OcompletionTests.ECInstVarTypeGuesserTest.testConstantInteger
  • Failed: OcompletionTests.ECInstVarTypeGuesserTest.testConstantIntegerNil
  • Failed: OcompletionTests.ECInstVarTypeGuesserTest.testConstantString
  • Failed: OcompletionTests.ECInstVarTypeGuesserTest.testConstantSymbol
  • Failed: OcompletionTests.ECInstVarTypeGuesserTest.testGlobalVarKeyword
  • Failed: OcompletionTests.ECInstVarTypeGuesserTest.testGlobalVarKeyword2
  • Failed: OcompletionTests.ECInstVarTypeGuesserTest.testMessageSend
  • Failed: OcompletionTests.ECInstVarTypeGuesserTest.testMessageSend2
  • Failed: OcompletionTests.ECInstVarTypeGuesserTest.testSuperWithAnotherInit
  • Failed: OcompletionTests.ECInstVarTypeGuesserTest.testTypeSuggestingParameter
  • Name: ProfStef.Tests Failed: 0 test(s), Passed: 47 test(s), Skipped: 0 test(s), Total: 47 test(s)
    Name: Refactoring.Tests.Changes Failed: 0 test(s), Passed: 43 test(s), Skipped: 0 test(s), Total: 43 test(s)
    Name: Refactoring.Tests.Core Failed: 0 test(s), Passed: 215 test(s), Skipped: 0 test(s), Total: 215 test(s)
    Name: Refactoring.Tests.Critics Failed: 0 test(s), Passed: 57 test(s), Skipped: 0 test(s), Total: 57 test(s)
    Name: Refactoring.Tests.Environment Failed: 0 test(s), Passed: 20 test(s), Skipped: 0 test(s), Total: 20 test(s)
    Name: Refactoring.Tests.Spelling Failed: 0 test(s), Passed: 16 test(s), Skipped: 0 test(s), Total: 16 test(s)
    Name: Regex.Tests.Core Failed: 0 test(s), Passed: 188 test(s), Skipped: 0 test(s), Total: 188 test(s)
    Name: RoelTyper.Tests Failed: 0 test(s), Passed: 72 test(s), Skipped: 0 test(s), Total: 72 test(s)
    Name: SUnit.Core.Extensions Failed: 0 test(s), Passed: 3 test(s), Skipped: 0 test(s), Total: 3 test(s)
    Name: SUnit.Core.Utilities Failed: 0 test(s), Passed: 3 test(s), Skipped: 0 test(s), Total: 3 test(s)
    Name: SUnit.Tests.Core Failed: 0 test(s), Passed: 77 test(s), Skipped: 0 test(s), Total: 77 test(s)
    Name: ShoutTests.Parsing Failed: 0 test(s), Passed: 5 test(s), Skipped: 0 test(s), Total: 5 test(s)
    Name: StratifiedProxy.Tests Failed: 0 test(s), Passed: 2 test(s), Skipped: 0 test(s), Total: 2 test(s)
    Name: Tests.Browser Failed: 0 test(s), Passed: 7 test(s), Skipped: 0 test(s), Total: 7 test(s)
    Name: Tests.Bugs Failed: 0 test(s), Passed: 60 test(s), Skipped: 0 test(s), Total: 60 test(s)
    Name: Tests.Compiler Failed: 0 test(s), Passed: 71 test(s), Skipped: 0 test(s), Total: 71 test(s)
    Name: Tests.Compression Failed: 0 test(s), Passed: 9 test(s), Skipped: 0 test(s), Total: 9 test(s)
    Name: Tests.Digital Signatures Failed: 0 test(s), Passed: 8 test(s), Skipped: 0 test(s), Total: 8 test(s)
    Name: Tests.Exceptions Failed: 0 test(s), Passed: 28 test(s), Skipped: 0 test(s), Total: 28 test(s)
    Name: Tests.Files Failed: 0 test(s), Passed: 55 test(s), Skipped: 0 test(s), Total: 55 test(s)
    Name: Tests.Finalization Failed: 0 test(s), Passed: 1 test(s), Skipped: 0 test(s), Total: 1 test(s)
    Name: Tests.Localization Failed: 0 test(s), Passed: 1 test(s), Skipped: 0 test(s), Total: 1 test(s)
    Name: Tests.Monticello Failed: 0 test(s), Passed: 120 test(s), Skipped: 0 test(s), Total: 120 test(s)
    Name: Tests.Multilingual Failed: 0 test(s), Passed: 3 test(s), Skipped: 0 test(s), Total: 3 test(s)
    Name: Tests.Object Events Failed: 0 test(s), Passed: 24 test(s), Skipped: 0 test(s), Total: 24 test(s)
    Name: Tests.ObjectsAsMethods Failed: 0 test(s), Passed: 3 test(s), Skipped: 0 test(s), Total: 3 test(s)
    Name: Tests.PackageInfo Failed: 0 test(s), Passed: 1 test(s), Skipped: 0 test(s), Total: 1 test(s)
    Name: Tests.Polymorph.Widgets Failed: 0 test(s), Passed: 9 test(s), Skipped: 0 test(s), Total: 9 test(s)
    Name: Tests.Release Failed: 1 test(s), Passed: 2 test(s), Skipped: 0 test(s), Total: 3 test(s)
  • Failed: Tests.Release.ReleaseTest.testUndeclared
  • Name: Tests.ScriptLoader Failed: 0 test(s), Passed: 4 test(s), Skipped: 0 test(s), Total: 4 test(s)
    Name: Tests.System Failed: 0 test(s), Passed: 298 test(s), Skipped: 0 test(s), Total: 298 test(s)
    Name: Tests.SystemChangeNotification Failed: 0 test(s), Passed: 37 test(s), Skipped: 0 test(s), Total: 37 test(s)
    Name: Tests.SystemHistory Failed: 0 test(s), Passed: 14 test(s), Skipped: 0 test(s), Total: 14 test(s)
    Name: Tests.SystemSupport Failed: 0 test(s), Passed: 9 test(s), Skipped: 0 test(s), Total: 9 test(s)
    Name: Tests.TextEditors Failed: 0 test(s), Passed: 7 test(s), Skipped: 0 test(s), Total: 7 test(s)
    Name: Tests.Traits Failed: 0 test(s), Passed: 60 test(s), Skipped: 0 test(s), Total: 60 test(s)
    Name: Tests.Traits.MOP Failed: 0 test(s), Passed: 3 test(s), Skipped: 0 test(s), Total: 3 test(s)
    Name: Tests.VM Failed: 0 test(s), Passed: 10 test(s), Skipped: 0 test(s), Total: 10 test(s)
    Name: ToolsTest.Debugger Failed: 0 test(s), Passed: 10 test(s), Skipped: 0 test(s), Total: 10 test(s)
    Name: ToolsTest.Inspector Failed: 0 test(s), Passed: 1 test(s), Skipped: 0 test(s), Total: 1 test(s)
    Name: ToolsTest.MessageTally Failed: 0 test(s), Passed: 5 test(s), Skipped: 0 test(s), Total: 5 test(s)
    Name: ToolsTest.PointerFinder Failed: 0 test(s), Passed: 3 test(s), Skipped: 0 test(s), Total: 3 test(s)
    Name: Zinc.Tests Failed: 0 test(s), Passed: 201 test(s), Skipped: 0 test(s), Total: 201 test(s)

    Reply | Threaded
    Open this post in threaded view
    |  
    Report Content as Inappropriate

    Pharo 1.3 - Build # 18 - Failure!

    jenkins-pharo.ci.inria.fr
    BUILD FAILURE
    Build URLhttps://ci.lille.inria.fr/pharo/job/Pharo%201.3/18/
    Project:Pharo 1.3
    Date of build:Thu, 01 Mar 2012 14:54:45 +0100
    Build duration:18 s

    CHANGES
    No Changes

    BUILD ARTIFACTS
  • Pharo-1.3/Pharo-1.3.st
  • Pharo-1.3.changes
  • Pharo-1.3.image
  • Pharo-1.3.zip

  • CONSOLE OUTPUT

    Reply | Threaded
    Open this post in threaded view
    |  
    Report Content as Inappropriate

    Pharo 1.3 - Build # 19 - Still unstable!

    jenkins-pharo.ci.inria.fr
    BUILD UNSTABLE
    Build URLhttps://ci.lille.inria.fr/pharo/job/Pharo%201.3/19/
    Project:Pharo 1.3
    Date of build:Mon, 05 Mar 2012 10:15:05 +0100
    Build duration:38 mn

    CHANGES
    No Changes

    BUILD ARTIFACTS
  • Pharo-1.3/Pharo-1.3.st
  • Pharo-1.3.changes
  • Pharo-1.3.image
  • Pharo-1.3.zip

  • JUnit Tests
    Name: AST.Tests.Core Failed: 0 test(s), Passed: 69 test(s), Skipped: 0 test(s), Total: 69 test(s)
    Name: AST.Tests.Semantic Failed: 0 test(s), Passed: 25 test(s), Skipped: 0 test(s), Total: 25 test(s)
    Name: Announcements.Tests.Core Failed: 0 test(s), Passed: 27 test(s), Skipped: 0 test(s), Total: 27 test(s)
    Name: AutomaticMethodCategorizer.Tests Failed: 0 test(s), Passed: 14 test(s), Skipped: 0 test(s), Total: 14 test(s)
    Name: AutomaticMethodCategorizerOB.Tests Failed: 0 test(s), Passed: 2 test(s), Skipped: 0 test(s), Total: 2 test(s)
    Name: Autotest.Tests.Core Failed: 0 test(s), Passed: 27 test(s), Skipped: 0 test(s), Total: 27 test(s)
    Name: Autotest.Tests.GUI Failed: 0 test(s), Passed: 1 test(s), Skipped: 0 test(s), Total: 1 test(s)
    Name: Balloon.Collections.Tests Failed: 0 test(s), Passed: 34 test(s), Skipped: 0 test(s), Total: 34 test(s)
    Name: CollectionsTests.Arrayed Failed: 0 test(s), Passed: 562 test(s), Skipped: 0 test(s), Total: 562 test(s)
    Name: CollectionsTests.Atomic Failed: 0 test(s), Passed: 12 test(s), Skipped: 0 test(s), Total: 12 test(s)
    Name: CollectionsTests.Sequenceable Failed: 0 test(s), Passed: 912 test(s), Skipped: 0 test(s), Total: 912 test(s)
    Name: CollectionsTests.SplitJoin Failed: 0 test(s), Passed: 27 test(s), Skipped: 0 test(s), Total: 27 test(s)
    Name: CollectionsTests.Stack Failed: 0 test(s), Passed: 16 test(s), Skipped: 0 test(s), Total: 16 test(s)
    Name: CollectionsTests.Streams Failed: 0 test(s), Passed: 25 test(s), Skipped: 0 test(s), Total: 25 test(s)
    Name: CollectionsTests.Strings Failed: 0 test(s), Passed: 590 test(s), Skipped: 0 test(s), Total: 590 test(s)
    Name: CollectionsTests.Support Failed: 0 test(s), Passed: 12 test(s), Skipped: 0 test(s), Total: 12 test(s)
    Name: CollectionsTests.Text Failed: 0 test(s), Passed: 40 test(s), Skipped: 0 test(s), Total: 40 test(s)
    Name: CollectionsTests.Unordered Failed: 0 test(s), Passed: 1977 test(s), Skipped: 0 test(s), Total: 1977 test(s)
    Name: CollectionsTests.Weak Failed: 0 test(s), Passed: 751 test(s), Skipped: 0 test(s), Total: 751 test(s)
    Name: CompilerTests Failed: 0 test(s), Passed: 30 test(s), Skipped: 0 test(s), Total: 30 test(s)
    Name: CompressionTests.Archive Failed: 0 test(s), Passed: 2 test(s), Skipped: 0 test(s), Total: 2 test(s)
    Name: Finder.Tests Failed: 0 test(s), Passed: 9 test(s), Skipped: 0 test(s), Total: 9 test(s)
    Name: FreeTypeTests.cache Failed: 0 test(s), Passed: 23 test(s), Skipped: 0 test(s), Total: 23 test(s)
    Name: Gofer.Tests Failed: 0 test(s), Passed: 45 test(s), Skipped: 0 test(s), Total: 45 test(s)
    Name: Graphics.Tests.Files Failed: 0 test(s), Passed: 47 test(s), Skipped: 0 test(s), Total: 47 test(s)
    Name: Graphics.Tests.Primitives Failed: 0 test(s), Passed: 57 test(s), Skipped: 0 test(s), Total: 57 test(s)
    Name: Graphics.Tests.Text Failed: 0 test(s), Passed: 2 test(s), Skipped: 0 test(s), Total: 2 test(s)
    Name: HelpSystem.Tests.Builders Failed: 0 test(s), Passed: 5 test(s), Skipped: 0 test(s), Total: 5 test(s)
    Name: HelpSystem.Tests.Core.Model Failed: 0 test(s), Passed: 4 test(s), Skipped: 0 test(s), Total: 4 test(s)
    Name: HelpSystem.Tests.Core.UI Failed: 0 test(s), Passed: 6 test(s), Skipped: 0 test(s), Total: 6 test(s)
    Name: HelpSystem.Tests.Core.Utilities Failed: 0 test(s), Passed: 2 test(s), Skipped: 0 test(s), Total: 2 test(s)
    Name: KernelTests.Chronology Failed: 0 test(s), Passed: 575 test(s), Skipped: 0 test(s), Total: 575 test(s)
    Name: KernelTests.Classes Failed: 0 test(s), Passed: 60 test(s), Skipped: 0 test(s), Total: 60 test(s)
    Name: KernelTests.Exception Failed: 0 test(s), Passed: 2 test(s), Skipped: 0 test(s), Total: 2 test(s)
    Name: KernelTests.Methods Failed: 0 test(s), Passed: 188 test(s), Skipped: 0 test(s), Total: 188 test(s)
    Name: KernelTests.Numbers Failed: 0 test(s), Passed: 220 test(s), Skipped: 0 test(s), Total: 220 test(s)
    Name: KernelTests.Objects Failed: 0 test(s), Passed: 84 test(s), Skipped: 0 test(s), Total: 84 test(s)
    Name: KernelTests.Pragmas Failed: 0 test(s), Passed: 3 test(s), Skipped: 0 test(s), Total: 3 test(s)
    Name: KernelTests.Processes Failed: 0 test(s), Passed: 22 test(s), Skipped: 0 test(s), Total: 22 test(s)
    Name: LED.Test Failed: 0 test(s), Passed: 2 test(s), Skipped: 0 test(s), Total: 2 test(s)
    Name: Metacello.TestsCore Failed: 0 test(s), Passed: 44 test(s), Skipped: 0 test(s), Total: 44 test(s)
    Name: Metacello.TestsMC Failed: 0 test(s), Passed: 303 test(s), Skipped: 0 test(s), Total: 303 test(s)
    Name: Metacello.TestsPlatform Failed: 0 test(s), Passed: 1 test(s), Skipped: 0 test(s), Total: 1 test(s)
    Name: Metacello.TestsProfStef Failed: 0 test(s), Passed: 1 test(s), Skipped: 0 test(s), Total: 1 test(s)
    Name: Metacello.TestsReference Failed: 0 test(s), Passed: 2 test(s), Skipped: 0 test(s), Total: 2 test(s)
    Name: Metacello.TestsTutorial Failed: 0 test(s), Passed: 32 test(s), Skipped: 0 test(s), Total: 32 test(s)
    Name: MethodWrappers.Tests Failed: 0 test(s), Passed: 2 test(s), Skipped: 0 test(s), Total: 2 test(s)
    Name: MorphicTests.Basic Failed: 0 test(s), Passed: 16 test(s), Skipped: 0 test(s), Total: 16 test(s)
    Name: MorphicTests.Kernel Failed: 0 test(s), Passed: 8 test(s), Skipped: 0 test(s), Total: 8 test(s)
    Name: MorphicTests.Text Support Failed: 0 test(s), Passed: 14 test(s), Skipped: 0 test(s), Total: 14 test(s)
    Name: MorphicTests.Widgets Failed: 0 test(s), Passed: 5 test(s), Skipped: 0 test(s), Total: 5 test(s)
    Name: MorphicTests.WindowNotification Failed: 0 test(s), Passed: 7 test(s), Skipped: 0 test(s), Total: 7 test(s)
    Name: Multilingual.Tests.TextConversion Failed: 0 test(s), Passed: 7 test(s), Skipped: 0 test(s), Total: 7 test(s)
    Name: NetworkTests.Kernel Failed: 0 test(s), Passed: 31 test(s), Skipped: 0 test(s), Total: 31 test(s)
    Name: NetworkTests.MailMessage Failed: 0 test(s), Passed: 2 test(s), Skipped: 0 test(s), Total: 2 test(s)
    Name: NetworkTests.Protocols Failed: 0 test(s), Passed: 3 test(s), Skipped: 0 test(s), Total: 3 test(s)
    Name: NetworkTests.RFC822 Failed: 0 test(s), Passed: 1 test(s), Skipped: 0 test(s), Total: 1 test(s)
    Name: NetworkTests.URI Failed: 0 test(s), Passed: 105 test(s), Skipped: 0 test(s), Total: 105 test(s)
    Name: NetworkTests.UUID Failed: 0 test(s), Passed: 11 test(s), Skipped: 0 test(s), Total: 11 test(s)
    Name: NetworkTests.Url Failed: 0 test(s), Passed: 42 test(s), Skipped: 0 test(s), Total: 42 test(s)
    Name: OB.Fake.Tests Failed: 0 test(s), Passed: 10 test(s), Skipped: 0 test(s), Total: 10 test(s)
    Name: OB.Tests.Core Failed: 0 test(s), Passed: 89 test(s), Skipped: 0 test(s), Total: 89 test(s)
    Name: OB.Tests.Morphic Failed: 0 test(s), Passed: 24 test(s), Skipped: 0 test(s), Total: 24 test(s)
    Name: OB.Tests.Standard Failed: 0 test(s), Passed: 647 test(s), Skipped: 0 test(s), Total: 647 test(s)
    Name: OcompletionTests Failed: 14 test(s), Passed: 64 test(s), Skipped: 0 test(s), Total: 78 test(s)
  • Failed: OcompletionTests.ECInstVarTypeGuesserTest.testComplexInit
  • Failed: OcompletionTests.ECInstVarTypeGuesserTest.testComplexInit2
  • Failed: OcompletionTests.ECInstVarTypeGuesserTest.testConstantArray
  • Failed: OcompletionTests.ECInstVarTypeGuesserTest.testConstantBoolean
  • Failed: OcompletionTests.ECInstVarTypeGuesserTest.testConstantInteger
  • Failed: OcompletionTests.ECInstVarTypeGuesserTest.testConstantIntegerNil
  • Failed: OcompletionTests.ECInstVarTypeGuesserTest.testConstantString
  • Failed: OcompletionTests.ECInstVarTypeGuesserTest.testConstantSymbol
  • Failed: OcompletionTests.ECInstVarTypeGuesserTest.testGlobalVarKeyword
  • Failed: OcompletionTests.ECInstVarTypeGuesserTest.testGlobalVarKeyword2
  • Failed: OcompletionTests.ECInstVarTypeGuesserTest.testMessageSend
  • Failed: OcompletionTests.ECInstVarTypeGuesserTest.testMessageSend2
  • Failed: OcompletionTests.ECInstVarTypeGuesserTest.testSuperWithAnotherInit
  • Failed: OcompletionTests.ECInstVarTypeGuesserTest.testTypeSuggestingParameter
  • Name: ProfStef.Tests Failed: 0 test(s), Passed: 47 test(s), Skipped: 0 test(s), Total: 47 test(s)
    Name: Refactoring.Tests.Changes Failed: 0 test(s), Passed: 43 test(s), Skipped: 0 test(s), Total: 43 test(s)
    Name: Refactoring.Tests.Core Failed: 0 test(s), Passed: 215 test(s), Skipped: 0 test(s), Total: 215 test(s)
    Name: Refactoring.Tests.Critics Failed: 0 test(s), Passed: 57 test(s), Skipped: 0 test(s), Total: 57 test(s)
    Name: Refactoring.Tests.Environment Failed: 0 test(s), Passed: 20 test(s), Skipped: 0 test(s), Total: 20 test(s)
    Name: Refactoring.Tests.Spelling Failed: 0 test(s), Passed: 16 test(s), Skipped: 0 test(s), Total: 16 test(s)
    Name: Regex.Tests.Core Failed: 0 test(s), Passed: 188 test(s), Skipped: 0 test(s), Total: 188 test(s)
    Name: RoelTyper.Tests Failed: 0 test(s), Passed: 72 test(s), Skipped: 0 test(s), Total: 72 test(s)
    Name: SUnit.Core.Extensions Failed: 0 test(s), Passed: 3 test(s), Skipped: 0 test(s), Total: 3 test(s)
    Name: SUnit.Core.Utilities Failed: 0 test(s), Passed: 3 test(s), Skipped: 0 test(s), Total: 3 test(s)
    Name: SUnit.Tests.Core Failed: 0 test(s), Passed: 77 test(s), Skipped: 0 test(s), Total: 77 test(s)
    Name: ShoutTests.Parsing Failed: 0 test(s), Passed: 5 test(s), Skipped: 0 test(s), Total: 5 test(s)
    Name: StratifiedProxy.Tests Failed: 0 test(s), Passed: 2 test(s), Skipped: 0 test(s), Total: 2 test(s)
    Name: Tests.Browser Failed: 0 test(s), Passed: 7 test(s), Skipped: 0 test(s), Total: 7 test(s)
    Name: Tests.Bugs Failed: 0 test(s), Passed: 60 test(s), Skipped: 0 test(s), Total: 60 test(s)
    Name: Tests.Compiler Failed: 0 test(s), Passed: 71 test(s), Skipped: 0 test(s), Total: 71 test(s)
    Name: Tests.Compression Failed: 0 test(s), Passed: 9 test(s), Skipped: 0 test(s), Total: 9 test(s)
    Name: Tests.Digital Signatures Failed: 0 test(s), Passed: 8 test(s), Skipped: 0 test(s), Total: 8 test(s)
    Name: Tests.Exceptions Failed: 0 test(s), Passed: 28 test(s), Skipped: 0 test(s), Total: 28 test(s)
    Name: Tests.Files Failed: 0 test(s), Passed: 55 test(s), Skipped: 0 test(s), Total: 55 test(s)
    Name: Tests.Finalization Failed: 0 test(s), Passed: 1 test(s), Skipped: 0 test(s), Total: 1 test(s)
    Name: Tests.Localization Failed: 0 test(s), Passed: 1 test(s), Skipped: 0 test(s), Total: 1 test(s)
    Name: Tests.Monticello Failed: 0 test(s), Passed: 120 test(s), Skipped: 0 test(s), Total: 120 test(s)
    Name: Tests.Multilingual Failed: 0 test(s), Passed: 3 test(s), Skipped: 0 test(s), Total: 3 test(s)
    Name: Tests.Object Events Failed: 0 test(s), Passed: 24 test(s), Skipped: 0 test(s), Total: 24 test(s)
    Name: Tests.ObjectsAsMethods Failed: 0 test(s), Passed: 3 test(s), Skipped: 0 test(s), Total: 3 test(s)
    Name: Tests.PackageInfo Failed: 0 test(s), Passed: 1 test(s), Skipped: 0 test(s), Total: 1 test(s)
    Name: Tests.Polymorph.Widgets Failed: 0 test(s), Passed: 9 test(s), Skipped: 0 test(s), Total: 9 test(s)
    Name: Tests.Release Failed: 1 test(s), Passed: 2 test(s), Skipped: 0 test(s), Total: 3 test(s)
  • Failed: Tests.Release.ReleaseTest.testUndeclared
  • Name: Tests.ScriptLoader Failed: 0 test(s), Passed: 4 test(s), Skipped: 0 test(s), Total: 4 test(s)
    Name: Tests.System Failed: 0 test(s), Passed: 298 test(s), Skipped: 0 test(s), Total: 298 test(s)
    Name: Tests.SystemChangeNotification Failed: 0 test(s), Passed: 37 test(s), Skipped: 0 test(s), Total: 37 test(s)
    Name: Tests.SystemHistory Failed: 0 test(s), Passed: 14 test(s), Skipped: 0 test(s), Total: 14 test(s)
    Name: Tests.SystemSupport Failed: 0 test(s), Passed: 9 test(s), Skipped: 0 test(s), Total: 9 test(s)
    Name: Tests.TextEditors Failed: 0 test(s), Passed: 7 test(s), Skipped: 0 test(s), Total: 7 test(s)
    Name: Tests.Traits Failed: 0 test(s), Passed: 60 test(s), Skipped: 0 test(s), Total: 60 test(s)
    Name: Tests.Traits.MOP Failed: 0 test(s), Passed: 3 test(s), Skipped: 0 test(s), Total: 3 test(s)
    Name: Tests.VM Failed: 0 test(s), Passed: 10 test(s), Skipped: 0 test(s), Total: 10 test(s)
    Name: ToolsTest.Debugger Failed: 0 test(s), Passed: 10 test(s), Skipped: 0 test(s), Total: 10 test(s)
    Name: ToolsTest.Inspector Failed: 0 test(s), Passed: 1 test(s), Skipped: 0 test(s), Total: 1 test(s)
    Name: ToolsTest.MessageTally Failed: 0 test(s), Passed: 5 test(s), Skipped: 0 test(s), Total: 5 test(s)
    Name: ToolsTest.PointerFinder Failed: 0 test(s), Passed: 3 test(s), Skipped: 0 test(s), Total: 3 test(s)
    Name: Zinc.Tests Failed: 0 test(s), Passed: 201 test(s), Skipped: 0 test(s), Total: 201 test(s)

    Reply | Threaded
    Open this post in threaded view
    |  
    Report Content as Inappropriate

    Pharo 1.3 - Build # 20 - Still Unstable!

    jenkins-pharo.ci.inria.fr
    BUILD UNSTABLE
    Build URLhttps://ci.lille.inria.fr/pharo/job/Pharo%201.3/20/
    Project:Pharo 1.3
    Date of build:Thu, 08 Mar 2012 17:20:26 +0100
    Build duration:19 mn

    CHANGES
    No Changes

    BUILD ARTIFACTS
  • Pharo-1.3/Pharo-1.3.st
  • Pharo-1.3.changes
  • Pharo-1.3.image
  • Pharo-1.3.zip

  • JUnit Tests
    Name: AST.Tests.Core Failed: 0 test(s), Passed: 69 test(s), Skipped: 0 test(s), Total: 69 test(s)
    Name: AST.Tests.Semantic Failed: 0 test(s), Passed: 25 test(s), Skipped: 0 test(s), Total: 25 test(s)
    Name: Announcements.Tests.Core Failed: 0 test(s), Passed: 27 test(s), Skipped: 0 test(s), Total: 27 test(s)
    Name: AutomaticMethodCategorizer.Tests Failed: 0 test(s), Passed: 14 test(s), Skipped: 0 test(s), Total: 14 test(s)
    Name: AutomaticMethodCategorizerOB.Tests Failed: 0 test(s), Passed: 2 test(s), Skipped: 0 test(s), Total: 2 test(s)
    Name: Autotest.Tests.Core Failed: 0 test(s), Passed: 27 test(s), Skipped: 0 test(s), Total: 27 test(s)
    Name: Autotest.Tests.GUI Failed: 0 test(s), Passed: 1 test(s), Skipped: 0 test(s), Total: 1 test(s)
    Name: Balloon.Collections.Tests Failed: 0 test(s), Passed: 34 test(s), Skipped: 0 test(s), Total: 34 test(s)
    Name: CollectionsTests.Arrayed Failed: 0 test(s), Passed: 562 test(s), Skipped: 0 test(s), Total: 562 test(s)
    Name: CollectionsTests.Atomic Failed: 0 test(s), Passed: 12 test(s), Skipped: 0 test(s), Total: 12 test(s)
    Name: CollectionsTests.Sequenceable Failed: 1 test(s), Passed: 911 test(s), Skipped: 0 test(s), Total: 912 test(s)
  • Failed: CollectionsTests.Sequenceable.SharedQueue2Test.testCounting
  • Name: CollectionsTests.SplitJoin Failed: 0 test(s), Passed: 27 test(s), Skipped: 0 test(s), Total: 27 test(s)
    Name: CollectionsTests.Stack Failed: 0 test(s), Passed: 16 test(s), Skipped: 0 test(s), Total: 16 test(s)
    Name: CollectionsTests.Streams Failed: 0 test(s), Passed: 25 test(s), Skipped: 0 test(s), Total: 25 test(s)
    Name: CollectionsTests.Strings Failed: 0 test(s), Passed: 590 test(s), Skipped: 0 test(s), Total: 590 test(s)
    Name: CollectionsTests.Support Failed: 0 test(s), Passed: 12 test(s), Skipped: 0 test(s), Total: 12 test(s)
    Name: CollectionsTests.Text Failed: 0 test(s), Passed: 40 test(s), Skipped: 0 test(s), Total: 40 test(s)
    Name: CollectionsTests.Unordered Failed: 0 test(s), Passed: 1977 test(s), Skipped: 0 test(s), Total: 1977 test(s)
    Name: CollectionsTests.Weak Failed: 0 test(s), Passed: 751 test(s), Skipped: 0 test(s), Total: 751 test(s)
    Name: CompilerTests Failed: 0 test(s), Passed: 30 test(s), Skipped: 0 test(s), Total: 30 test(s)
    Name: CompressionTests.Archive Failed: 0 test(s), Passed: 2 test(s), Skipped: 0 test(s), Total: 2 test(s)
    Name: Finder.Tests Failed: 0 test(s), Passed: 9 test(s), Skipped: 0 test(s), Total: 9 test(s)
    Name: FreeTypeTests.cache Failed: 0 test(s), Passed: 23 test(s), Skipped: 0 test(s), Total: 23 test(s)
    Name: Gofer.Tests Failed: 0 test(s), Passed: 45 test(s), Skipped: 0 test(s), Total: 45 test(s)
    Name: Graphics.Tests.Files Failed: 0 test(s), Passed: 47 test(s), Skipped: 0 test(s), Total: 47 test(s)
    Name: Graphics.Tests.Primitives Failed: 0 test(s), Passed: 57 test(s), Skipped: 0 test(s), Total: 57 test(s)
    Name: Graphics.Tests.Text Failed: 0 test(s), Passed: 2 test(s), Skipped: 0 test(s), Total: 2 test(s)
    Name: HelpSystem.Tests.Builders Failed: 0 test(s), Passed: 5 test(s), Skipped: 0 test(s), Total: 5 test(s)
    Name: HelpSystem.Tests.Core.Model Failed: 0 test(s), Passed: 4 test(s), Skipped: 0 test(s), Total: 4 test(s)
    Name: HelpSystem.Tests.Core.UI Failed: 0 test(s), Passed: 6 test(s), Skipped: 0 test(s), Total: 6 test(s)
    Name: HelpSystem.Tests.Core.Utilities Failed: 0 test(s), Passed: 2 test(s), Skipped: 0 test(s), Total: 2 test(s)
    Name: KernelTests.Chronology Failed: 0 test(s), Passed: 575 test(s), Skipped: 0 test(s), Total: 575 test(s)
    Name: KernelTests.Classes Failed: 0 test(s), Passed: 60 test(s), Skipped: 0 test(s), Total: 60 test(s)
    Name: KernelTests.Exception Failed: 0 test(s), Passed: 2 test(s), Skipped: 0 test(s), Total: 2 test(s)
    Name: KernelTests.Methods Failed: 1 test(s), Passed: 187 test(s), Skipped: 0 test(s), Total: 188 test(s)
  • Failed: KernelTests.Methods.MethodContextTest.testClosureRestart
  • Name: KernelTests.Numbers Failed: 0 test(s), Passed: 220 test(s), Skipped: 0 test(s), Total: 220 test(s)
    Name: KernelTests.Objects Failed: 0 test(s), Passed: 84 test(s), Skipped: 0 test(s), Total: 84 test(s)
    Name: KernelTests.Pragmas Failed: 0 test(s), Passed: 3 test(s), Skipped: 0 test(s), Total: 3 test(s)
    Name: KernelTests.Processes Failed: 0 test(s), Passed: 22 test(s), Skipped: 0 test(s), Total: 22 test(s)
    Name: LED.Test Failed: 0 test(s), Passed: 2 test(s), Skipped: 0 test(s), Total: 2 test(s)
    Name: Metacello.TestsCore Failed: 0 test(s), Passed: 44 test(s), Skipped: 0 test(s), Total: 44 test(s)
    Name: Metacello.TestsMC Failed: 0 test(s), Passed: 303 test(s), Skipped: 0 test(s), Total: 303 test(s)
    Name: Metacello.TestsPlatform Failed: 0 test(s), Passed: 1 test(s), Skipped: 0 test(s), Total: 1 test(s)
    Name: Metacello.TestsProfStef Failed: 0 test(s), Passed: 1 test(s), Skipped: 0 test(s), Total: 1 test(s)
    Name: Metacello.TestsReference Failed: 0 test(s), Passed: 2 test(s), Skipped: 0 test(s), Total: 2 test(s)
    Name: Metacello.TestsTutorial Failed: 0 test(s), Passed: 32 test(s), Skipped: 0 test(s), Total: 32 test(s)
    Name: MethodWrappers.Tests Failed: 0 test(s), Passed: 2 test(s), Skipped: 0 test(s), Total: 2 test(s)
    Name: MorphicTests.Basic Failed: 0 test(s), Passed: 16 test(s), Skipped: 0 test(s), Total: 16 test(s)
    Name: MorphicTests.Kernel Failed: 0 test(s), Passed: 8 test(s), Skipped: 0 test(s), Total: 8 test(s)
    Name: MorphicTests.Text Support Failed: 0 test(s), Passed: 14 test(s), Skipped: 0 test(s), Total: 14 test(s)
    Name: MorphicTests.Widgets Failed: 0 test(s), Passed: 5 test(s), Skipped: 0 test(s), Total: 5 test(s)
    Name: MorphicTests.WindowNotification Failed: 0 test(s), Passed: 7 test(s), Skipped: 0 test(s), Total: 7 test(s)
    Name: Multilingual.Tests.TextConversion Failed: 0 test(s), Passed: 7 test(s), Skipped: 0 test(s), Total: 7 test(s)
    Name: NetworkTests.Kernel Failed: 0 test(s), Passed: 31 test(s), Skipped: 0 test(s), Total: 31 test(s)
    Name: NetworkTests.MailMessage Failed: 0 test(s), Passed: 2 test(s), Skipped: 0 test(s), Total: 2 test(s)
    Name: NetworkTests.Protocols Failed: 0 test(s), Passed: 3 test(s), Skipped: 0 test(s), Total: 3 test(s)
    Name: NetworkTests.RFC822 Failed: 0 test(s), Passed: 1 test(s), Skipped: 0 test(s), Total: 1 test(s)
    Name: NetworkTests.URI Failed: 0 test(s), Passed: 105 test(s), Skipped: 0 test(s), Total: 105 test(s)
    Name: NetworkTests.UUID Failed: 0 test(s), Passed: 11 test(s), Skipped: 0 test(s), Total: 11 test(s)
    Name: NetworkTests.Url Failed: 0 test(s), Passed: 42 test(s), Skipped: 0 test(s), Total: 42 test(s)
    Name: OB.Fake.Tests Failed: 0 test(s), Passed: 10 test(s), Skipped: 0 test(s), Total: 10 test(s)
    Name: OB.Tests.Core Failed: 0 test(s), Passed: 89 test(s), Skipped: 0 test(s), Total: 89 test(s)
    Name: OB.Tests.Morphic Failed: 0 test(s), Passed: 24 test(s), Skipped: 0 test(s), Total: 24 test(s)
    Name: OB.Tests.Standard Failed: 0 test(s), Passed: 647 test(s), Skipped: 0 test(s), Total: 647 test(s)
    Name: OcompletionTests Failed: 14 test(s), Passed: 64 test(s), Skipped: 0 test(s), Total: 78 test(s)
  • Failed: OcompletionTests.ECInstVarTypeGuesserTest.testComplexInit
  • Failed: OcompletionTests.ECInstVarTypeGuesserTest.testComplexInit2
  • Failed: OcompletionTests.ECInstVarTypeGuesserTest.testConstantArray
  • Failed: OcompletionTests.ECInstVarTypeGuesserTest.testConstantBoolean
  • Failed: OcompletionTests.ECInstVarTypeGuesserTest.testConstantInteger
  • Failed: OcompletionTests.ECInstVarTypeGuesserTest.testConstantIntegerNil
  • Failed: OcompletionTests.ECInstVarTypeGuesserTest.testConstantString
  • Failed: OcompletionTests.ECInstVarTypeGuesserTest.testConstantSymbol
  • Failed: OcompletionTests.ECInstVarTypeGuesserTest.testGlobalVarKeyword
  • Failed: OcompletionTests.ECInstVarTypeGuesserTest.testGlobalVarKeyword2
  • Failed: OcompletionTests.ECInstVarTypeGuesserTest.testMessageSend
  • Failed: OcompletionTests.ECInstVarTypeGuesserTest.testMessageSend2
  • Failed: OcompletionTests.ECInstVarTypeGuesserTest.testSuperWithAnotherInit
  • Failed: OcompletionTests.ECInstVarTypeGuesserTest.testTypeSuggestingParameter
  • Name: ProfStef.Tests Failed: 0 test(s), Passed: 47 test(s), Skipped: 0 test(s), Total: 47 test(s)
    Name: Refactoring.Tests.Changes Failed: 0 test(s), Passed: 43 test(s), Skipped: 0 test(s), Total: 43 test(s)
    Name: Refactoring.Tests.Core Failed: 0 test(s), Passed: 215 test(s), Skipped: 0 test(s), Total: 215 test(s)
    Name: Refactoring.Tests.Critics Failed: 0 test(s), Passed: 57 test(s), Skipped: 0 test(s), Total: 57 test(s)
    Name: Refactoring.Tests.Environment Failed: 0 test(s), Passed: 20 test(s), Skipped: 0 test(s), Total: 20 test(s)
    Name: Refactoring.Tests.Spelling Failed: 0 test(s), Passed: 16 test(s), Skipped: 0 test(s), Total: 16 test(s)
    Name: Regex.Tests.Core Failed: 0 test(s), Passed: 188 test(s), Skipped: 0 test(s), Total: 188 test(s)
    Name: RoelTyper.Tests Failed: 0 test(s), Passed: 72 test(s), Skipped: 0 test(s), Total: 72 test(s)
    Name: SUnit.Core.Extensions Failed: 0 test(s), Passed: 3 test(s), Skipped: 0 test(s), Total: 3 test(s)
    Name: SUnit.Core.Utilities Failed: 0 test(s), Passed: 3 test(s), Skipped: 0 test(s), Total: 3 test(s)
    Name: SUnit.Tests.Core Failed: 0 test(s), Passed: 77 test(s), Skipped: 0 test(s), Total: 77 test(s)
    Name: ShoutTests.Parsing Failed: 0 test(s), Passed: 5 test(s), Skipped: 0 test(s), Total: 5 test(s)
    Name: StratifiedProxy.Tests Failed: 0 test(s), Passed: 2 test(s), Skipped: 0 test(s), Total: 2 test(s)
    Name: Tests.Browser Failed: 0 test(s), Passed: 7 test(s), Skipped: 0 test(s), Total: 7 test(s)
    Name: Tests.Bugs Failed: 0 test(s), Passed: 60 test(s), Skipped: 0 test(s), Total: 60 test(s)
    Name: Tests.Compiler Failed: 0 test(s), Passed: 71 test(s), Skipped: 0 test(s), Total: 71 test(s)
    Name: Tests.Compression Failed: 0 test(s), Passed: 9 test(s), Skipped: 0 test(s), Total: 9 test(s)
    Name: Tests.Digital Signatures Failed: 0 test(s), Passed: 8 test(s), Skipped: 0 test(s), Total: 8 test(s)
    Name: Tests.Exceptions Failed: 0 test(s), Passed: 28 test(s), Skipped: 0 test(s), Total: 28 test(s)
    Name: Tests.Files Failed: 1 test(s), Passed: 54 test(s), Skipped: 0 test(s), Total: 55 test(s)
  • Failed: Tests.Files.FileStreamTest.testPositionPastEndIsAtEnd
  • Name: Tests.Finalization Failed: 0 test(s), Passed: 1 test(s), Skipped: 0 test(s), Total: 1 test(s)
    Name: Tests.Localization Failed: 0 test(s), Passed: 1 test(s), Skipped: 0 test(s), Total: 1 test(s)
    Name: Tests.Monticello Failed: 0 test(s), Passed: 120 test(s), Skipped: 0 test(s), Total: 120 test(s)
    Name: Tests.Multilingual Failed: 0 test(s), Passed: 3 test(s), Skipped: 0 test(s), Total: 3 test(s)
    Name: Tests.Object Events Failed: 0 test(s), Passed: 24 test(s), Skipped: 0 test(s), Total: 24 test(s)
    Name: Tests.ObjectsAsMethods Failed: 0 test(s), Passed: 3 test(s), Skipped: 0 test(s), Total: 3 test(s)
    Name: Tests.PackageInfo Failed: 0 test(s), Passed: 1 test(s), Skipped: 0 test(s), Total: 1 test(s)
    Name: Tests.Polymorph.Widgets Failed: 0 test(s), Passed: 9 test(s), Skipped: 0 test(s), Total: 9 test(s)
    Name: Tests.Release Failed: 1 test(s), Passed: 2 test(s), Skipped: 0 test(s), Total: 3 test(s)
  • Failed: Tests.Release.ReleaseTest.testUndeclared
  • Name: Tests.ScriptLoader Failed: 0 test(s), Passed: 4 test(s), Skipped: 0 test(s), Total: 4 test(s)
    Name: Tests.System Failed: 0 test(s), Passed: 298 test(s), Skipped: 0 test(s), Total: 298 test(s)
    Name: Tests.SystemChangeNotification Failed: 0 test(s), Passed: 37 test(s), Skipped: 0 test(s), Total: 37 test(s)
    Name: Tests.SystemHistory Failed: 0 test(s), Passed: 14 test(s), Skipped: 0 test(s), Total: 14 test(s)
    Name: Tests.SystemSupport Failed: 0 test(s), Passed: 9 test(s), Skipped: 0 test(s), Total: 9 test(s)
    Name: Tests.TextEditors Failed: 0 test(s), Passed: 7 test(s), Skipped: 0 test(s), Total: 7 test(s)
    Name: Tests.Traits Failed: 0 test(s), Passed: 60 test(s), Skipped: 0 test(s), Total: 60 test(s)
    Name: Tests.Traits.MOP Failed: 0 test(s), Passed: 3 test(s), Skipped: 0 test(s), Total: 3 test(s)
    Name: Tests.VM Failed: 0 test(s), Passed: 10 test(s), Skipped: 0 test(s), Total: 10 test(s)
    Name: ToolsTest.Debugger Failed: 0 test(s), Passed: 10 test(s), Skipped: 0 test(s), Total: 10 test(s)
    Name: ToolsTest.Inspector Failed: 0 test(s), Passed: 1 test(s), Skipped: 0 test(s), Total: 1 test(s)
    Name: ToolsTest.MessageTally Failed: 0 test(s), Passed: 5 test(s), Skipped: 0 test(s), Total: 5 test(s)
    Name: ToolsTest.PointerFinder Failed: 0 test(s), Passed: 3 test(s), Skipped: 0 test(s), Total: 3 test(s)
    Name: Zinc.Tests Failed: 0 test(s), Passed: 201 test(s), Skipped: 0 test(s), Total: 201 test(s)

    Reply | Threaded
    Open this post in threaded view
    |  
    Report Content as Inappropriate

    Pharo 1.3 - Build # 21 - Still Unstable!

    jenkins-pharo.ci.inria.fr
    BUILD UNSTABLE
    Build URLhttps://ci.lille.inria.fr/pharo/job/Pharo%201.3/21/
    Project:Pharo 1.3
    Date of build:Mon, 12 Mar 2012 14:32:09 +0100
    Build duration:20 mn

    CHANGES
    No Changes

    BUILD ARTIFACTS
  • Pharo-1.3/Pharo-1.3.st
  • Pharo-1.3.changes
  • Pharo-1.3.image
  • Pharo-1.3.zip

  • JUnit Tests
    Name: AST.Tests.Core Failed: 0 test(s), Passed: 69 test(s), Skipped: 0 test(s), Total: 69 test(s)
    Name: AST.Tests.Semantic Failed: 0 test(s), Passed: 25 test(s), Skipped: 0 test(s), Total: 25 test(s)
    Name: Announcements.Tests.Core Failed: 0 test(s), Passed: 27 test(s), Skipped: 0 test(s), Total: 27 test(s)
    Name: AutomaticMethodCategorizer.Tests Failed: 0 test(s), Passed: 14 test(s), Skipped: 0 test(s), Total: 14 test(s)
    Name: AutomaticMethodCategorizerOB.Tests Failed: 0 test(s), Passed: 2 test(s), Skipped: 0 test(s), Total: 2 test(s)
    Name: Autotest.Tests.Core Failed: 0 test(s), Passed: 27 test(s), Skipped: 0 test(s), Total: 27 test(s)
    Name: Autotest.Tests.GUI Failed: 0 test(s), Passed: 1 test(s), Skipped: 0 test(s), Total: 1 test(s)
    Name: Balloon.Collections.Tests Failed: 0 test(s), Passed: 34 test(s), Skipped: 0 test(s), Total: 34 test(s)
    Name: CollectionsTests.Arrayed Failed: 0 test(s), Passed: 562 test(s), Skipped: 0 test(s), Total: 562 test(s)
    Name: CollectionsTests.Atomic Failed: 0 test(s), Passed: 12 test(s), Skipped: 0 test(s), Total: 12 test(s)
    Name: CollectionsTests.Sequenceable Failed: 0 test(s), Passed: 912 test(s), Skipped: 0 test(s), Total: 912 test(s)
    Name: CollectionsTests.SplitJoin Failed: 0 test(s), Passed: 27 test(s), Skipped: 0 test(s), Total: 27 test(s)
    Name: CollectionsTests.Stack Failed: 0 test(s), Passed: 16 test(s), Skipped: 0 test(s), Total: 16 test(s)
    Name: CollectionsTests.Streams Failed: 0 test(s), Passed: 25 test(s), Skipped: 0 test(s), Total: 25 test(s)
    Name: CollectionsTests.Strings Failed: 0 test(s), Passed: 590 test(s), Skipped: 0 test(s), Total: 590 test(s)
    Name: CollectionsTests.Support Failed: 0 test(s), Passed: 12 test(s), Skipped: 0 test(s), Total: 12 test(s)
    Name: CollectionsTests.Text Failed: 0 test(s), Passed: 40 test(s), Skipped: 0 test(s), Total: 40 test(s)
    Name: CollectionsTests.Unordered Failed: 0 test(s), Passed: 1977 test(s), Skipped: 0 test(s), Total: 1977 test(s)
    Name: CollectionsTests.Weak Failed: 0 test(s), Passed: 751 test(s), Skipped: 0 test(s), Total: 751 test(s)
    Name: CompilerTests Failed: 0 test(s), Passed: 30 test(s), Skipped: 0 test(s), Total: 30 test(s)
    Name: CompressionTests.Archive Failed: 0 test(s), Passed: 2 test(s), Skipped: 0 test(s), Total: 2 test(s)
    Name: Finder.Tests Failed: 0 test(s), Passed: 9 test(s), Skipped: 0 test(s), Total: 9 test(s)
    Name: FreeTypeTests.cache Failed: 0 test(s), Passed: 23 test(s), Skipped: 0 test(s), Total: 23 test(s)
    Name: Gofer.Tests Failed: 0 test(s), Passed: 45 test(s), Skipped: 0 test(s), Total: 45 test(s)
    Name: Graphics.Tests.Files Failed: 0 test(s), Passed: 47 test(s), Skipped: 0 test(s), Total: 47 test(s)
    Name: Graphics.Tests.Primitives Failed: 0 test(s), Passed: 57 test(s), Skipped: 0 test(s), Total: 57 test(s)
    Name: Graphics.Tests.Text Failed: 0 test(s), Passed: 2 test(s), Skipped: 0 test(s), Total: 2 test(s)
    Name: HelpSystem.Tests.Builders Failed: 0 test(s), Passed: 5 test(s), Skipped: 0 test(s), Total: 5 test(s)
    Name: HelpSystem.Tests.Core.Model Failed: 0 test(s), Passed: 4 test(s), Skipped: 0 test(s), Total: 4 test(s)
    Name: HelpSystem.Tests.Core.UI Failed: 0 test(s), Passed: 6 test(s), Skipped: 0 test(s), Total: 6 test(s)
    Name: HelpSystem.Tests.Core.Utilities Failed: 0 test(s), Passed: 2 test(s), Skipped: 0 test(s), Total: 2 test(s)
    Name: KernelTests.Chronology Failed: 0 test(s), Passed: 575 test(s), Skipped: 0 test(s), Total: 575 test(s)
    Name: KernelTests.Classes Failed: 0 test(s), Passed: 60 test(s), Skipped: 0 test(s), Total: 60 test(s)
    Name: KernelTests.Exception Failed: 0 test(s), Passed: 2 test(s), Skipped: 0 test(s), Total: 2 test(s)
    Name: KernelTests.Methods Failed: 0 test(s), Passed: 188 test(s), Skipped: 0 test(s), Total: 188 test(s)
    Name: KernelTests.Numbers Failed: 0 test(s), Passed: 220 test(s), Skipped: 0 test(s), Total: 220 test(s)
    Name: KernelTests.Objects Failed: 0 test(s), Passed: 84 test(s), Skipped: 0 test(s), Total: 84 test(s)
    Name: KernelTests.Pragmas Failed: 0 test(s), Passed: 3 test(s), Skipped: 0 test(s), Total: 3 test(s)
    Name: KernelTests.Processes Failed: 0 test(s), Passed: 22 test(s), Skipped: 0 test(s), Total: 22 test(s)
    Name: LED.Test Failed: 0 test(s), Passed: 2 test(s), Skipped: 0 test(s), Total: 2 test(s)
    Name: Metacello.TestsCore Failed: 0 test(s), Passed: 44 test(s), Skipped: 0 test(s), Total: 44 test(s)
    Name: Metacello.TestsMC Failed: 0 test(s), Passed: 303 test(s), Skipped: 0 test(s), Total: 303 test(s)
    Name: Metacello.TestsPlatform Failed: 0 test(s), Passed: 1 test(s), Skipped: 0 test(s), Total: 1 test(s)
    Name: Metacello.TestsProfStef Failed: 0 test(s), Passed: 1 test(s), Skipped: 0 test(s), Total: 1 test(s)
    Name: Metacello.TestsReference Failed: 0 test(s), Passed: 2 test(s), Skipped: 0 test(s), Total: 2 test(s)
    Name: Metacello.TestsTutorial Failed: 0 test(s), Passed: 32 test(s), Skipped: 0 test(s), Total: 32 test(s)
    Name: MethodWrappers.Tests Failed: 0 test(s), Passed: 2 test(s), Skipped: 0 test(s), Total: 2 test(s)
    Name: MorphicTests.Basic Failed: 0 test(s), Passed: 16 test(s), Skipped: 0 test(s), Total: 16 test(s)
    Name: MorphicTests.Kernel Failed: 0 test(s), Passed: 8 test(s), Skipped: 0 test(s), Total: 8 test(s)
    Name: MorphicTests.Text Support Failed: 0 test(s), Passed: 14 test(s), Skipped: 0 test(s), Total: 14 test(s)
    Name: MorphicTests.Widgets Failed: 0 test(s), Passed: 5 test(s), Skipped: 0 test(s), Total: 5 test(s)
    Name: MorphicTests.WindowNotification Failed: 0 test(s), Passed: 7 test(s), Skipped: 0 test(s), Total: 7 test(s)
    Name: Multilingual.Tests.TextConversion Failed: 0 test(s), Passed: 7 test(s), Skipped: 0 test(s), Total: 7 test(s)
    Name: NetworkTests.Kernel Failed: 0 test(s), Passed: 31 test(s), Skipped: 0 test(s), Total: 31 test(s)
    Name: NetworkTests.MailMessage Failed: 0 test(s), Passed: 2 test(s), Skipped: 0 test(s), Total: 2 test(s)
    Name: NetworkTests.Protocols Failed: 0 test(s), Passed: 3 test(s), Skipped: 0 test(s), Total: 3 test(s)
    Name: NetworkTests.RFC822 Failed: 0 test(s), Passed: 1 test(s), Skipped: 0 test(s), Total: 1 test(s)
    Name: NetworkTests.URI Failed: 0 test(s), Passed: 105 test(s), Skipped: 0 test(s), Total: 105 test(s)
    Name: NetworkTests.UUID Failed: 0 test(s), Passed: 11 test(s), Skipped: 0 test(s), Total: 11 test(s)
    Name: NetworkTests.Url Failed: 0 test(s), Passed: 42 test(s), Skipped: 0 test(s), Total: 42 test(s)
    Name: OB.Fake.Tests Failed: 0 test(s), Passed: 10 test(s), Skipped: 0 test(s), Total: 10 test(s)
    Name: OB.Tests.Core Failed: 0 test(s), Passed: 89 test(s), Skipped: 0 test(s), Total: 89 test(s)
    Name: OB.Tests.Morphic Failed: 0 test(s), Passed: 24 test(s), Skipped: 0 test(s), Total: 24 test(s)
    Name: OB.Tests.Standard Failed: 0 test(s), Passed: 647 test(s), Skipped: 0 test(s), Total: 647 test(s)
    Name: OcompletionTests Failed: 14 test(s), Passed: 64 test(s), Skipped: 0 test(s), Total: 78 test(s)
  • Failed: OcompletionTests.ECInstVarTypeGuesserTest.testComplexInit
  • Failed: OcompletionTests.ECInstVarTypeGuesserTest.testComplexInit2
  • Failed: OcompletionTests.ECInstVarTypeGuesserTest.testConstantArray
  • Failed: OcompletionTests.ECInstVarTypeGuesserTest.testConstantBoolean
  • Failed: OcompletionTests.ECInstVarTypeGuesserTest.testConstantInteger
  • Failed: OcompletionTests.ECInstVarTypeGuesserTest.testConstantIntegerNil
  • Failed: OcompletionTests.ECInstVarTypeGuesserTest.testConstantString
  • Failed: OcompletionTests.ECInstVarTypeGuesserTest.testConstantSymbol
  • Failed: OcompletionTests.ECInstVarTypeGuesserTest.testGlobalVarKeyword
  • Failed: OcompletionTests.ECInstVarTypeGuesserTest.testGlobalVarKeyword2
  • Failed: OcompletionTests.ECInstVarTypeGuesserTest.testMessageSend
  • Failed: OcompletionTests.ECInstVarTypeGuesserTest.testMessageSend2
  • Failed: OcompletionTests.ECInstVarTypeGuesserTest.testSuperWithAnotherInit
  • Failed: OcompletionTests.ECInstVarTypeGuesserTest.testTypeSuggestingParameter
  • Name: ProfStef.Tests Failed: 0 test(s), Passed: 47 test(s), Skipped: 0 test(s), Total: 47 test(s)
    Name: Refactoring.Tests.Changes Failed: 0 test(s), Passed: 43 test(s), Skipped: 0 test(s), Total: 43 test(s)
    Name: Refactoring.Tests.Core Failed: 0 test(s), Passed: 215 test(s), Skipped: 0 test(s), Total: 215 test(s)
    Name: Refactoring.Tests.Critics Failed: 0 test(s), Passed: 57 test(s), Skipped: 0 test(s), Total: 57 test(s)
    Name: Refactoring.Tests.Environment Failed: 0 test(s), Passed: 20 test(s), Skipped: 0 test(s), Total: 20 test(s)
    Name: Refactoring.Tests.Spelling Failed: 0 test(s), Passed: 16 test(s), Skipped: 0 test(s), Total: 16 test(s)
    Name: Regex.Tests.Core Failed: 0 test(s), Passed: 188 test(s), Skipped: 0 test(s), Total: 188 test(s)
    Name: RoelTyper.Tests Failed: 0 test(s), Passed: 72 test(s), Skipped: 0 test(s), Total: 72 test(s)
    Name: SUnit.Core.Extensions Failed: 0 test(s), Passed: 3 test(s), Skipped: 0 test(s), Total: 3 test(s)
    Name: SUnit.Core.Utilities Failed: 0 test(s), Passed: 3 test(s), Skipped: 0 test(s), Total: 3 test(s)
    Name: SUnit.Tests.Core Failed: 0 test(s), Passed: 77 test(s), Skipped: 0 test(s), Total: 77 test(s)
    Name: ShoutTests.Parsing Failed: 0 test(s), Passed: 5 test(s), Skipped: 0 test(s), Total: 5 test(s)
    Name: StratifiedProxy.Tests Failed: 0 test(s), Passed: 2 test(s), Skipped: 0 test(s), Total: 2 test(s)
    Name: Tests.Browser Failed: 0 test(s), Passed: 7 test(s), Skipped: 0 test(s), Total: 7 test(s)
    Name: Tests.Bugs Failed: 0 test(s), Passed: 60 test(s), Skipped: 0 test(s), Total: 60 test(s)
    Name: Tests.Compiler Failed: 0 test(s), Passed: 71 test(s), Skipped: 0 test(s), Total: 71 test(s)
    Name: Tests.Compression Failed: 0 test(s), Passed: 9 test(s), Skipped: 0 test(s), Total: 9 test(s)
    Name: Tests.Digital Signatures Failed: 0 test(s), Passed: 8 test(s), Skipped: 0 test(s), Total: 8 test(s)
    Name: Tests.Exceptions Failed: 0 test(s), Passed: 28 test(s), Skipped: 0 test(s), Total: 28 test(s)
    Name: Tests.Files Failed: 0 test(s), Passed: 54 test(s), Skipped: 0 test(s), Total: 54 test(s)
    Name: Tests.Finalization Failed: 0 test(s), Passed: 1 test(s), Skipped: 0 test(s), Total: 1 test(s)
    Name: Tests.Localization Failed: 0 test(s), Passed: 1 test(s), Skipped: 0 test(s), Total: 1 test(s)
    Name: Tests.Monticello Failed: 0 test(s), Passed: 120 test(s), Skipped: 0 test(s), Total: 120 test(s)
    Name: Tests.Multilingual Failed: 0 test(s), Passed: 3 test(s), Skipped: 0 test(s), Total: 3 test(s)
    Name: Tests.Object Events Failed: 0 test(s), Passed: 24 test(s), Skipped: 0 test(s), Total: 24 test(s)
    Name: Tests.ObjectsAsMethods Failed: 0 test(s), Passed: 3 test(s), Skipped: 0 test(s), Total: 3 test(s)
    Name: Tests.PackageInfo Failed: 0 test(s), Passed: 1 test(s), Skipped: 0 test(s), Total: 1 test(s)
    Name: Tests.Polymorph.Widgets Failed: 0 test(s), Passed: 9 test(s), Skipped: 0 test(s), Total: 9 test(s)
    Name: Tests.Release Failed: 1 test(s), Passed: 2 test(s), Skipped: 0 test(s), Total: 3 test(s)
  • Failed: Tests.Release.ReleaseTest.testUndeclared
  • Name: Tests.ScriptLoader Failed: 0 test(s), Passed: 4 test(s), Skipped: 0 test(s), Total: 4 test(s)
    Name: Tests.System Failed: 0 test(s), Passed: 298 test(s), Skipped: 0 test(s), Total: 298 test(s)
    Name: Tests.SystemChangeNotification Failed: 0 test(s), Passed: 37 test(s), Skipped: 0 test(s), Total: 37 test(s)
    Name: Tests.SystemHistory Failed: 0 test(s), Passed: 14 test(s), Skipped: 0 test(s), Total: 14 test(s)
    Name: Tests.SystemSupport Failed: 0 test(s), Passed: 9 test(s), Skipped: 0 test(s), Total: 9 test(s)
    Name: Tests.TextEditors Failed: 0 test(s), Passed: 7 test(s), Skipped: 0 test(s), Total: 7 test(s)
    Name: Tests.Traits Failed: 0 test(s), Passed: 60 test(s), Skipped: 0 test(s), Total: 60 test(s)
    Name: Tests.Traits.MOP Failed: 0 test(s), Passed: 3 test(s), Skipped: 0 test(s), Total: 3 test(s)
    Name: Tests.VM Failed: 0 test(s), Passed: 10 test(s), Skipped: 0 test(s), Total: 10 test(s)
    Name: ToolsTest.Debugger Failed: 0 test(s), Passed: 10 test(s), Skipped: 0 test(s), Total: 10 test(s)
    Name: ToolsTest.Inspector Failed: 0 test(s), Passed: 1 test(s), Skipped: 0 test(s), Total: 1 test(s)
    Name: ToolsTest.MessageTally Failed: 0 test(s), Passed: 5 test(s), Skipped: 0 test(s), Total: 5 test(s)
    Name: ToolsTest.PointerFinder Failed: 0 test(s), Passed: 3 test(s), Skipped: 0 test(s), Total: 3 test(s)
    Name: Zinc.Tests Failed: 0 test(s), Passed: 201 test(s), Skipped: 0 test(s), Total: 201 test(s)

    Reply | Threaded
    Open this post in threaded view
    |  
    Report Content as Inappropriate

    Pharo 1.3 - Build # 22 - Still Unstable!

    jenkins-pharo.ci.inria.fr
    BUILD UNSTABLE
    Build URLhttps://ci.lille.inria.fr/pharo/job/Pharo%201.3/22/
    Project:Pharo 1.3
    Date of build:Mon, 12 Mar 2012 19:50:25 +0100
    Build duration:19 mn

    CHANGES
    No Changes

    BUILD ARTIFACTS
  • Pharo-1.3/Pharo-1.3.st
  • Pharo-1.3.changes
  • Pharo-1.3.image
  • Pharo-1.3.zip

  • JUnit Tests
    Name: AST.Tests.Core Failed: 0 test(s), Passed: 69 test(s), Skipped: 0 test(s), Total: 69 test(s)
    Name: AST.Tests.Semantic Failed: 0 test(s), Passed: 25 test(s), Skipped: 0 test(s), Total: 25 test(s)
    Name: Announcements.Tests.Core Failed: 0 test(s), Passed: 27 test(s), Skipped: 0 test(s), Total: 27 test(s)
    Name: AutomaticMethodCategorizer.Tests Failed: 0 test(s), Passed: 14 test(s), Skipped: 0 test(s), Total: 14 test(s)
    Name: AutomaticMethodCategorizerOB.Tests Failed: 0 test(s), Passed: 2 test(s), Skipped: 0 test(s), Total: 2 test(s)
    Name: Autotest.Tests.Core Failed: 0 test(s), Passed: 27 test(s), Skipped: 0 test(s), Total: 27 test(s)
    Name: Autotest.Tests.GUI Failed: 0 test(s), Passed: 1 test(s), Skipped: 0 test(s), Total: 1 test(s)
    Name: Balloon.Collections.Tests Failed: 0 test(s), Passed: 34 test(s), Skipped: 0 test(s), Total: 34 test(s)
    Name: CollectionsTests.Arrayed Failed: 0 test(s), Passed: 562 test(s), Skipped: 0 test(s), Total: 562 test(s)
    Name: CollectionsTests.Atomic Failed: 0 test(s), Passed: 12 test(s), Skipped: 0 test(s), Total: 12 test(s)
    Name: CollectionsTests.Sequenceable Failed: 0 test(s), Passed: 912 test(s), Skipped: 0 test(s), Total: 912 test(s)
    Name: CollectionsTests.SplitJoin Failed: 0 test(s), Passed: 27 test(s), Skipped: 0 test(s), Total: 27 test(s)
    Name: CollectionsTests.Stack Failed: 0 test(s), Passed: 16 test(s), Skipped: 0 test(s), Total: 16 test(s)
    Name: CollectionsTests.Streams Failed: 0 test(s), Passed: 25 test(s), Skipped: 0 test(s), Total: 25 test(s)
    Name: CollectionsTests.Strings Failed: 0 test(s), Passed: 590 test(s), Skipped: 0 test(s), Total: 590 test(s)
    Name: CollectionsTests.Support Failed: 0 test(s), Passed: 12 test(s), Skipped: 0 test(s), Total: 12 test(s)
    Name: CollectionsTests.Text Failed: 0 test(s), Passed: 40 test(s), Skipped: 0 test(s), Total: 40 test(s)
    Name: CollectionsTests.Unordered Failed: 0 test(s), Passed: 1977 test(s), Skipped: 0 test(s), Total: 1977 test(s)
    Name: CollectionsTests.Weak Failed: 0 test(s), Passed: 751 test(s), Skipped: 0 test(s), Total: 751 test(s)
    Name: CompilerTests Failed: 0 test(s), Passed: 30 test(s), Skipped: 0 test(s), Total: 30 test(s)
    Name: CompressionTests.Archive Failed: 0 test(s), Passed: 2 test(s), Skipped: 0 test(s), Total: 2 test(s)
    Name: Finder.Tests Failed: 0 test(s), Passed: 9 test(s), Skipped: 0 test(s), Total: 9 test(s)
    Name: FreeTypeTests.cache Failed: 0 test(s), Passed: 23 test(s), Skipped: 0 test(s), Total: 23 test(s)
    Name: Gofer.Tests Failed: 0 test(s), Passed: 45 test(s), Skipped: 0 test(s), Total: 45 test(s)
    Name: Graphics.Tests.Files Failed: 0 test(s), Passed: 47 test(s), Skipped: 0 test(s), Total: 47 test(s)
    Name: Graphics.Tests.Primitives Failed: 0 test(s), Passed: 57 test(s), Skipped: 0 test(s), Total: 57 test(s)
    Name: Graphics.Tests.Text Failed: 0 test(s), Passed: 2 test(s), Skipped: 0 test(s), Total: 2 test(s)
    Name: HelpSystem.Tests.Builders Failed: 0 test(s), Passed: 5 test(s), Skipped: 0 test(s), Total: 5 test(s)
    Name: HelpSystem.Tests.Core.Model Failed: 0 test(s), Passed: 4 test(s), Skipped: 0 test(s), Total: 4 test(s)
    Name: HelpSystem.Tests.Core.UI Failed: 0 test(s), Passed: 6 test(s), Skipped: 0 test(s), Total: 6 test(s)
    Name: HelpSystem.Tests.Core.Utilities Failed: 0 test(s), Passed: 2 test(s), Skipped: 0 test(s), Total: 2 test(s)
    Name: KernelTests.Chronology Failed: 0 test(s), Passed: 575 test(s), Skipped: 0 test(s), Total: 575 test(s)
    Name: KernelTests.Classes Failed: 0 test(s), Passed: 60 test(s), Skipped: 0 test(s), Total: 60 test(s)
    Name: KernelTests.Exception Failed: 0 test(s), Passed: 2 test(s), Skipped: 0 test(s), Total: 2 test(s)
    Name: KernelTests.Methods Failed: 0 test(s), Passed: 188 test(s), Skipped: 0 test(s), Total: 188 test(s)
    Name: KernelTests.Numbers Failed: 0 test(s), Passed: 220 test(s), Skipped: 0 test(s), Total: 220 test(s)
    Name: KernelTests.Objects Failed: 0 test(s), Passed: 84 test(s), Skipped: 0 test(s), Total: 84 test(s)
    Name: KernelTests.Pragmas Failed: 0 test(s), Passed: 3 test(s), Skipped: 0 test(s), Total: 3 test(s)
    Name: KernelTests.Processes Failed: 0 test(s), Passed: 22 test(s), Skipped: 0 test(s), Total: 22 test(s)
    Name: LED.Test Failed: 0 test(s), Passed: 2 test(s), Skipped: 0 test(s), Total: 2 test(s)
    Name: Metacello.TestsCore Failed: 0 test(s), Passed: 44 test(s), Skipped: 0 test(s), Total: 44 test(s)
    Name: Metacello.TestsMC Failed: 0 test(s), Passed: 303 test(s), Skipped: 0 test(s), Total: 303 test(s)
    Name: Metacello.TestsPlatform Failed: 0 test(s), Passed: 1 test(s), Skipped: 0 test(s), Total: 1 test(s)
    Name: Metacello.TestsProfStef Failed: 0 test(s), Passed: 1 test(s), Skipped: 0 test(s), Total: 1 test(s)
    Name: Metacello.TestsReference Failed: 0 test(s), Passed: 2 test(s), Skipped: 0 test(s), Total: 2 test(s)
    Name: Metacello.TestsTutorial Failed: 0 test(s), Passed: 32 test(s), Skipped: 0 test(s), Total: 32 test(s)
    Name: MethodWrappers.Tests Failed: 0 test(s), Passed: 2 test(s), Skipped: 0 test(s), Total: 2 test(s)
    Name: MorphicTests.Basic Failed: 0 test(s), Passed: 16 test(s), Skipped: 0 test(s), Total: 16 test(s)
    Name: MorphicTests.Kernel Failed: 0 test(s), Passed: 8 test(s), Skipped: 0 test(s), Total: 8 test(s)
    Name: MorphicTests.Text Support Failed: 0 test(s), Passed: 14 test(s), Skipped: 0 test(s), Total: 14 test(s)
    Name: MorphicTests.Widgets Failed: 0 test(s), Passed: 5 test(s), Skipped: 0 test(s), Total: 5 test(s)
    Name: MorphicTests.WindowNotification Failed: 0 test(s), Passed: 7 test(s), Skipped: 0 test(s), Total: 7 test(s)
    Name: Multilingual.Tests.TextConversion Failed: 0 test(s), Passed: 7 test(s), Skipped: 0 test(s), Total: 7 test(s)
    Name: NetworkTests.Kernel Failed: 0 test(s), Passed: 31 test(s), Skipped: 0 test(s), Total: 31 test(s)
    Name: NetworkTests.MailMessage Failed: 0 test(s), Passed: 2 test(s), Skipped: 0 test(s), Total: 2 test(s)
    Name: NetworkTests.Protocols Failed: 0 test(s), Passed: 3 test(s), Skipped: 0 test(s), Total: 3 test(s)
    Name: NetworkTests.RFC822 Failed: 0 test(s), Passed: 1 test(s), Skipped: 0 test(s), Total: 1 test(s)
    Name: NetworkTests.URI Failed: 0 test(s), Passed: 105 test(s), Skipped: 0 test(s), Total: 105 test(s)
    Name: NetworkTests.UUID Failed: 0 test(s), Passed: 11 test(s), Skipped: 0 test(s), Total: 11 test(s)
    Name: NetworkTests.Url Failed: 0 test(s), Passed: 42 test(s), Skipped: 0 test(s), Total: 42 test(s)
    Name: OB.Fake.Tests Failed: 0 test(s), Passed: 10 test(s), Skipped: 0 test(s), Total: 10 test(s)
    Name: OB.Tests.Core Failed: 0 test(s), Passed: 89 test(s), Skipped: 0 test(s), Total: 89 test(s)
    Name: OB.Tests.Morphic Failed: 0 test(s), Passed: 24 test(s), Skipped: 0 test(s), Total: 24 test(s)
    Name: OB.Tests.Standard Failed: 0 test(s), Passed: 647 test(s), Skipped: 0 test(s), Total: 647 test(s)
    Name: OcompletionTests Failed: 14 test(s), Passed: 64 test(s), Skipped: 0 test(s), Total: 78 test(s)
  • Failed: OcompletionTests.ECInstVarTypeGuesserTest.testComplexInit
  • Failed: OcompletionTests.ECInstVarTypeGuesserTest.testComplexInit2
  • Failed: OcompletionTests.ECInstVarTypeGuesserTest.testConstantArray
  • Failed: OcompletionTests.ECInstVarTypeGuesserTest.testConstantBoolean
  • Failed: OcompletionTests.ECInstVarTypeGuesserTest.testConstantInteger
  • Failed: OcompletionTests.ECInstVarTypeGuesserTest.testConstantIntegerNil
  • Failed: OcompletionTests.ECInstVarTypeGuesserTest.testConstantString
  • Failed: OcompletionTests.ECInstVarTypeGuesserTest.testConstantSymbol
  • Failed: OcompletionTests.ECInstVarTypeGuesserTest.testGlobalVarKeyword
  • Failed: OcompletionTests.ECInstVarTypeGuesserTest.testGlobalVarKeyword2
  • Failed: OcompletionTests.ECInstVarTypeGuesserTest.testMessageSend
  • Failed: OcompletionTests.ECInstVarTypeGuesserTest.testMessageSend2
  • Failed: OcompletionTests.ECInstVarTypeGuesserTest.testSuperWithAnotherInit
  • Failed: OcompletionTests.ECInstVarTypeGuesserTest.testTypeSuggestingParameter
  • Name: ProfStef.Tests Failed: 0 test(s), Passed: 47 test(s), Skipped: 0 test(s), Total: 47 test(s)
    Name: Refactoring.Tests.Changes Failed: 0 test(s), Passed: 43 test(s), Skipped: 0 test(s), Total: 43 test(s)
    Name: Refactoring.Tests.Core Failed: 0 test(s), Passed: 215 test(s), Skipped: 0 test(s), Total: 215 test(s)
    Name: Refactoring.Tests.Critics Failed: 0 test(s), Passed: 57 test(s), Skipped: 0 test(s), Total: 57 test(s)
    Name: Refactoring.Tests.Environment Failed: 0 test(s), Passed: 20 test(s), Skipped: 0 test(s), Total: 20 test(s)
    Name: Refactoring.Tests.Spelling Failed: 0 test(s), Passed: 16 test(s), Skipped: 0 test(s), Total: 16 test(s)
    Name: Regex.Tests.Core Failed: 0 test(s), Passed: 188 test(s), Skipped: 0 test(s), Total: 188 test(s)
    Name: RoelTyper.Tests Failed: 0 test(s), Passed: 72 test(s), Skipped: 0 test(s), Total: 72 test(s)
    Name: SUnit.Core.Extensions Failed: 0 test(s), Passed: 3 test(s), Skipped: 0 test(s), Total: 3 test(s)
    Name: SUnit.Core.Utilities Failed: 0 test(s), Passed: 3 test(s), Skipped: 0 test(s), Total: 3 test(s)
    Name: SUnit.Tests.Core Failed: 0 test(s), Passed: 77 test(s), Skipped: 0 test(s), Total: 77 test(s)
    Name: ShoutTests.Parsing Failed: 0 test(s), Passed: 5 test(s), Skipped: 0 test(s), Total: 5 test(s)
    Name: StratifiedProxy.Tests Failed: 0 test(s), Passed: 2 test(s), Skipped: 0 test(s), Total: 2 test(s)
    Name: Tests.Browser Failed: 0 test(s), Passed: 7 test(s), Skipped: 0 test(s), Total: 7 test(s)
    Name: Tests.Bugs Failed: 0 test(s), Passed: 60 test(s), Skipped: 0 test(s), Total: 60 test(s)
    Name: Tests.Compiler Failed: 0 test(s), Passed: 71 test(s), Skipped: 0 test(s), Total: 71 test(s)
    Name: Tests.Compression Failed: 0 test(s), Passed: 9 test(s), Skipped: 0 test(s), Total: 9 test(s)
    Name: Tests.Digital Signatures Failed: 0 test(s), Passed: 8 test(s), Skipped: 0 test(s), Total: 8 test(s)
    Name: Tests.Exceptions Failed: 0 test(s), Passed: 28 test(s), Skipped: 0 test(s), Total: 28 test(s)
    Name: Tests.Files Failed: 0 test(s), Passed: 54 test(s), Skipped: 0 test(s), Total: 54 test(s)
    Name: Tests.Finalization Failed: 0 test(s), Passed: 1 test(s), Skipped: 0 test(s), Total: 1 test(s)
    Name: Tests.Localization Failed: 0 test(s), Passed: 1 test(s), Skipped: 0 test(s), Total: 1 test(s)
    Name: Tests.Monticello Failed: 0 test(s), Passed: 120 test(s), Skipped: 0 test(s), Total: 120 test(s)
    Name: Tests.Multilingual Failed: 0 test(s), Passed: 3 test(s), Skipped: 0 test(s), Total: 3 test(s)
    Name: Tests.Object Events Failed: 0 test(s), Passed: 24 test(s), Skipped: 0 test(s), Total: 24 test(s)
    Name: Tests.ObjectsAsMethods Failed: 0 test(s), Passed: 3 test(s), Skipped: 0 test(s), Total: 3 test(s)
    Name: Tests.PackageInfo Failed: 0 test(s), Passed: 1 test(s), Skipped: 0 test(s), Total: 1 test(s)
    Name: Tests.Polymorph.Widgets Failed: 0 test(s), Passed: 9 test(s), Skipped: 0 test(s), Total: 9 test(s)
    Name: Tests.Release Failed: 1 test(s), Passed: 2 test(s), Skipped: 0 test(s), Total: 3 test(s)
  • Failed: Tests.Release.ReleaseTest.testUndeclared
  • Name: Tests.ScriptLoader Failed: 0 test(s), Passed: 4 test(s), Skipped: 0 test(s), Total: 4 test(s)
    Name: Tests.System Failed: 0 test(s), Passed: 298 test(s), Skipped: 0 test(s), Total: 298 test(s)
    Name: Tests.SystemChangeNotification Failed: 0 test(s), Passed: 37 test(s), Skipped: 0 test(s), Total: 37 test(s)
    Name: Tests.SystemHistory Failed: 0 test(s), Passed: 14 test(s), Skipped: 0 test(s), Total: 14 test(s)
    Name: Tests.SystemSupport Failed: 0 test(s), Passed: 9 test(s), Skipped: 0 test(s), Total: 9 test(s)
    Name: Tests.TextEditors Failed: 0 test(s), Passed: 7 test(s), Skipped: 0 test(s), Total: 7 test(s)
    Name: Tests.Traits Failed: 0 test(s), Passed: 60 test(s), Skipped: 0 test(s), Total: 60 test(s)
    Name: Tests.Traits.MOP Failed: 0 test(s), Passed: 3 test(s), Skipped: 0 test(s), Total: 3 test(s)
    Name: Tests.VM Failed: 0 test(s), Passed: 10 test(s), Skipped: 0 test(s), Total: 10 test(s)
    Name: ToolsTest.Debugger Failed: 0 test(s), Passed: 10 test(s), Skipped: 0 test(s), Total: 10 test(s)
    Name: ToolsTest.Inspector Failed: 0 test(s), Passed: 1 test(s), Skipped: 0 test(s), Total: 1 test(s)
    Name: ToolsTest.MessageTally Failed: 0 test(s), Passed: 5 test(s), Skipped: 0 test(s), Total: 5 test(s)
    Name: ToolsTest.PointerFinder Failed: 0 test(s), Passed: 3 test(s), Skipped: 0 test(s), Total: 3 test(s)
    Name: Zinc.Tests Failed: 0 test(s), Passed: 201 test(s), Skipped: 0 test(s), Total: 201 test(s)

    Reply | Threaded
    Open this post in threaded view
    |  
    Report Content as Inappropriate

    Pharo 1.3 - Build # 23 - Still Unstable!

    jenkins-pharo.ci.inria.fr
    BUILD UNSTABLE
    Build URLhttps://ci.lille.inria.fr/pharo/job/Pharo%201.3/23/
    Project:Pharo 1.3
    Date of build:Mon, 19 Mar 2012 15:33:14 +0100
    Build duration:20 mn

    CHANGES
    No Changes

    BUILD ARTIFACTS
  • Pharo-1.3/Pharo-1.3.st
  • Pharo-1.3.changes
  • Pharo-1.3.image
  • Pharo-1.3.zip

  • JUnit Tests
    Name: AST.Tests.Core Failed: 0 test(s), Passed: 69 test(s), Skipped: 0 test(s), Total: 69 test(s)
    Name: AST.Tests.Semantic Failed: 0 test(s), Passed: 25 test(s), Skipped: 0 test(s), Total: 25 test(s)
    Name: Announcements.Tests.Core Failed: 0 test(s), Passed: 27 test(s), Skipped: 0 test(s), Total: 27 test(s)
    Name: AutomaticMethodCategorizer.Tests Failed: 0 test(s), Passed: 14 test(s), Skipped: 0 test(s), Total: 14 test(s)
    Name: AutomaticMethodCategorizerOB.Tests Failed: 0 test(s), Passed: 2 test(s), Skipped: 0 test(s), Total: 2 test(s)
    Name: Autotest.Tests.Core Failed: 0 test(s), Passed: 27 test(s), Skipped: 0 test(s), Total: 27 test(s)
    Name: Autotest.Tests.GUI Failed: 0 test(s), Passed: 1 test(s), Skipped: 0 test(s), Total: 1 test(s)
    Name: Balloon.Collections.Tests Failed: 0 test(s), Passed: 34 test(s), Skipped: 0 test(s), Total: 34 test(s)
    Name: CollectionsTests.Arrayed Failed: 0 test(s), Passed: 562 test(s), Skipped: 0 test(s), Total: 562 test(s)
    Name: CollectionsTests.Atomic Failed: 0 test(s), Passed: 12 test(s), Skipped: 0 test(s), Total: 12 test(s)
    Name: CollectionsTests.Sequenceable Failed: 0 test(s), Passed: 912 test(s), Skipped: 0 test(s), Total: 912 test(s)
    Name: CollectionsTests.SplitJoin Failed: 0 test(s), Passed: 27 test(s), Skipped: 0 test(s), Total: 27 test(s)
    Name: CollectionsTests.Stack Failed: 0 test(s), Passed: 16 test(s), Skipped: 0 test(s), Total: 16 test(s)
    Name: CollectionsTests.Streams Failed: 0 test(s), Passed: 25 test(s), Skipped: 0 test(s), Total: 25 test(s)
    Name: CollectionsTests.Strings Failed: 0 test(s), Passed: 590 test(s), Skipped: 0 test(s), Total: 590 test(s)
    Name: CollectionsTests.Support Failed: 0 test(s), Passed: 12 test(s), Skipped: 0 test(s), Total: 12 test(s)
    Name: CollectionsTests.Text Failed: 0 test(s), Passed: 40 test(s), Skipped: 0 test(s), Total: 40 test(s)
    Name: CollectionsTests.Unordered Failed: 0 test(s), Passed: 1977 test(s), Skipped: 0 test(s), Total: 1977 test(s)
    Name: CollectionsTests.Weak Failed: 0 test(s), Passed: 751 test(s), Skipped: 0 test(s), Total: 751 test(s)
    Name: CompilerTests Failed: 0 test(s), Passed: 30 test(s), Skipped: 0 test(s), Total: 30 test(s)
    Name: CompressionTests.Archive Failed: 0 test(s), Passed: 2 test(s), Skipped: 0 test(s), Total: 2 test(s)
    Name: Finder.Tests Failed: 0 test(s), Passed: 9 test(s), Skipped: 0 test(s), Total: 9 test(s)
    Name: FreeTypeTests.cache Failed: 0 test(s), Passed: 23 test(s), Skipped: 0 test(s), Total: 23 test(s)
    Name: Gofer.Tests Failed: 0 test(s), Passed: 45 test(s), Skipped: 0 test(s), Total: 45 test(s)
    Name: Graphics.Tests.Files Failed: 0 test(s), Passed: 47 test(s), Skipped: 0 test(s), Total: 47 test(s)
    Name: Graphics.Tests.Primitives Failed: 0 test(s), Passed: 57 test(s), Skipped: 0 test(s), Total: 57 test(s)
    Name: Graphics.Tests.Text Failed: 0 test(s), Passed: 2 test(s), Skipped: 0 test(s), Total: 2 test(s)
    Name: HelpSystem.Tests.Builders Failed: 0 test(s), Passed: 5 test(s), Skipped: 0 test(s), Total: 5 test(s)
    Name: HelpSystem.Tests.Core.Model Failed: 0 test(s), Passed: 4 test(s), Skipped: 0 test(s), Total: 4 test(s)
    Name: HelpSystem.Tests.Core.UI Failed: 0 test(s), Passed: 6 test(s), Skipped: 0 test(s), Total: 6 test(s)
    Name: HelpSystem.Tests.Core.Utilities Failed: 0 test(s), Passed: 2 test(s), Skipped: 0 test(s), Total: 2 test(s)
    Name: KernelTests.Chronology Failed: 0 test(s), Passed: 575 test(s), Skipped: 0 test(s), Total: 575 test(s)
    Name: KernelTests.Classes Failed: 0 test(s), Passed: 60 test(s), Skipped: 0 test(s), Total: 60 test(s)
    Name: KernelTests.Exception Failed: 0 test(s), Passed: 2 test(s), Skipped: 0 test(s), Total: 2 test(s)
    Name: KernelTests.Methods Failed: 0 test(s), Passed: 188 test(s), Skipped: 0 test(s), Total: 188 test(s)
    Name: KernelTests.Numbers Failed: 0 test(s), Passed: 220 test(s), Skipped: 0 test(s), Total: 220 test(s)
    Name: KernelTests.Objects Failed: 0 test(s), Passed: 84 test(s), Skipped: 0 test(s), Total: 84 test(s)
    Name: KernelTests.Pragmas Failed: 0 test(s), Passed: 3 test(s), Skipped: 0 test(s), Total: 3 test(s)
    Name: KernelTests.Processes Failed: 0 test(s), Passed: 22 test(s), Skipped: 0 test(s), Total: 22 test(s)
    Name: LED.Test Failed: 0 test(s), Passed: 2 test(s), Skipped: 0 test(s), Total: 2 test(s)
    Name: Metacello.TestsCore Failed: 0 test(s), Passed: 44 test(s), Skipped: 0 test(s), Total: 44 test(s)
    Name: Metacello.TestsMC Failed: 0 test(s), Passed: 303 test(s), Skipped: 0 test(s), Total: 303 test(s)
    Name: Metacello.TestsPlatform Failed: 0 test(s), Passed: 1 test(s), Skipped: 0 test(s), Total: 1 test(s)
    Name: Metacello.TestsProfStef Failed: 0 test(s), Passed: 1 test(s), Skipped: 0 test(s), Total: 1 test(s)
    Name: Metacello.TestsReference Failed: 0 test(s), Passed: 2 test(s), Skipped: 0 test(s), Total: 2 test(s)
    Name: Metacello.TestsTutorial Failed: 0 test(s), Passed: 32 test(s), Skipped: 0 test(s), Total: 32 test(s)
    Name: MethodWrappers.Tests Failed: 0 test(s), Passed: 2 test(s), Skipped: 0 test(s), Total: 2 test(s)
    Name: MorphicTests.Basic Failed: 0 test(s), Passed: 16 test(s), Skipped: 0 test(s), Total: 16 test(s)
    Name: MorphicTests.Kernel Failed: 0 test(s), Passed: 8 test(s), Skipped: 0 test(s), Total: 8 test(s)
    Name: MorphicTests.Text Support Failed: 0 test(s), Passed: 14 test(s), Skipped: 0 test(s), Total: 14 test(s)
    Name: MorphicTests.Widgets Failed: 0 test(s), Passed: 5 test(s), Skipped: 0 test(s), Total: 5 test(s)
    Name: MorphicTests.WindowNotification Failed: 0 test(s), Passed: 7 test(s), Skipped: 0 test(s), Total: 7 test(s)
    Name: Multilingual.Tests.TextConversion Failed: 0 test(s), Passed: 7 test(s), Skipped: 0 test(s), Total: 7 test(s)
    Name: NetworkTests.Kernel Failed: 0 test(s), Passed: 31 test(s), Skipped: 0 test(s), Total: 31 test(s)
    Name: NetworkTests.MailMessage Failed: 0 test(s), Passed: 2 test(s), Skipped: 0 test(s), Total: 2 test(s)
    Name: NetworkTests.Protocols Failed: 0 test(s), Passed: 3 test(s), Skipped: 0 test(s), Total: 3 test(s)
    Name: NetworkTests.RFC822 Failed: 0 test(s), Passed: 1 test(s), Skipped: 0 test(s), Total: 1 test(s)
    Name: NetworkTests.URI Failed: 0 test(s), Passed: 105 test(s), Skipped: 0 test(s), Total: 105 test(s)
    Name: NetworkTests.UUID Failed: 0 test(s), Passed: 11 test(s), Skipped: 0 test(s), Total: 11 test(s)
    Name: NetworkTests.Url Failed: 0 test(s), Passed: 42 test(s), Skipped: 0 test(s), Total: 42 test(s)
    Name: OB.Fake.Tests Failed: 0 test(s), Passed: 10 test(s), Skipped: 0 test(s), Total: 10 test(s)
    Name: OB.Tests.Core Failed: 0 test(s), Passed: 89 test(s), Skipped: 0 test(s), Total: 89 test(s)
    Name: OB.Tests.Morphic Failed: 0 test(s), Passed: 24 test(s), Skipped: 0 test(s), Total: 24 test(s)
    Name: OB.Tests.Standard Failed: 0 test(s), Passed: 647 test(s), Skipped: 0 test(s), Total: 647 test(s)
    Name: OcompletionTests Failed: 14 test(s), Passed: 64 test(s), Skipped: 0 test(s), Total: 78 test(s)
  • Failed: OcompletionTests.ECInstVarTypeGuesserTest.testComplexInit
  • Failed: OcompletionTests.ECInstVarTypeGuesserTest.testComplexInit2
  • Failed: OcompletionTests.ECInstVarTypeGuesserTest.testConstantArray
  • Failed: OcompletionTests.ECInstVarTypeGuesserTest.testConstantBoolean
  • Failed: OcompletionTests.ECInstVarTypeGuesserTest.testConstantInteger
  • Failed: OcompletionTests.ECInstVarTypeGuesserTest.testConstantIntegerNil
  • Failed: OcompletionTests.ECInstVarTypeGuesserTest.testConstantString
  • Failed: OcompletionTests.ECInstVarTypeGuesserTest.testConstantSymbol
  • Failed: OcompletionTests.ECInstVarTypeGuesserTest.testGlobalVarKeyword
  • Failed: OcompletionTests.ECInstVarTypeGuesserTest.testGlobalVarKeyword2
  • Failed: OcompletionTests.ECInstVarTypeGuesserTest.testMessageSend
  • Failed: OcompletionTests.ECInstVarTypeGuesserTest.testMessageSend2
  • Failed: OcompletionTests.ECInstVarTypeGuesserTest.testSuperWithAnotherInit
  • Failed: OcompletionTests.ECInstVarTypeGuesserTest.testTypeSuggestingParameter
  • Name: ProfStef.Tests Failed: 0 test(s), Passed: 47 test(s), Skipped: 0 test(s), Total: 47 test(s)
    Name: Refactoring.Tests.Changes Failed: 0 test(s), Passed: 43 test(s), Skipped: 0 test(s), Total: 43 test(s)
    Name: Refactoring.Tests.Core Failed: 0 test(s), Passed: 215 test(s), Skipped: 0 test(s), Total: 215 test(s)
    Name: Refactoring.Tests.Critics Failed: 0 test(s), Passed: 57 test(s), Skipped: 0 test(s), Total: 57 test(s)
    Name: Refactoring.Tests.Environment Failed: 0 test(s), Passed: 20 test(s), Skipped: 0 test(s), Total: 20 test(s)
    Name: Refactoring.Tests.Spelling Failed: 0 test(s), Passed: 16 test(s), Skipped: 0 test(s), Total: 16 test(s)
    Name: Regex.Tests.Core Failed: 0 test(s), Passed: 188 test(s), Skipped: 0 test(s), Total: 188 test(s)
    Name: RoelTyper.Tests Failed: 0 test(s), Passed: 72 test(s), Skipped: 0 test(s), Total: 72 test(s)
    Name: SUnit.Core.Extensions Failed: 0 test(s), Passed: 3 test(s), Skipped: 0 test(s), Total: 3 test(s)
    Name: SUnit.Core.Utilities Failed: 0 test(s), Passed: 3 test(s), Skipped: 0 test(s), Total: 3 test(s)
    Name: SUnit.Tests.Core Failed: 0 test(s), Passed: 77 test(s), Skipped: 0 test(s), Total: 77 test(s)
    Name: ShoutTests.Parsing Failed: 0 test(s), Passed: 5 test(s), Skipped: 0 test(s), Total: 5 test(s)
    Name: StratifiedProxy.Tests Failed: 0 test(s), Passed: 2 test(s), Skipped: 0 test(s), Total: 2 test(s)
    Name: Tests.Browser Failed: 0 test(s), Passed: 7 test(s), Skipped: 0 test(s), Total: 7 test(s)
    Name: Tests.Bugs Failed: 0 test(s), Passed: 60 test(s), Skipped: 0 test(s), Total: 60 test(s)
    Name: Tests.Compiler Failed: 0 test(s), Passed: 71 test(s), Skipped: 0 test(s), Total: 71 test(s)
    Name: Tests.Compression Failed: 0 test(s), Passed: 9 test(s), Skipped: 0 test(s), Total: 9 test(s)
    Name: Tests.Digital Signatures Failed: 0 test(s), Passed: 8 test(s), Skipped: 0 test(s), Total: 8 test(s)
    Name: Tests.Exceptions Failed: 0 test(s), Passed: 28 test(s), Skipped: 0 test(s), Total: 28 test(s)
    Name: Tests.Files Failed: 0 test(s), Passed: 54 test(s), Skipped: 0 test(s), Total: 54 test(s)
    Name: Tests.Finalization Failed: 0 test(s), Passed: 1 test(s), Skipped: 0 test(s), Total: 1 test(s)
    Name: Tests.Localization Failed: 0 test(s), Passed: 1 test(s), Skipped: 0 test(s), Total: 1 test(s)
    Name: Tests.Monticello Failed: 0 test(s), Passed: 120 test(s), Skipped: 0 test(s), Total: 120 test(s)
    Name: Tests.Multilingual Failed: 0 test(s), Passed: 3 test(s), Skipped: 0 test(s), Total: 3 test(s)
    Name: Tests.Object Events Failed: 0 test(s), Passed: 24 test(s), Skipped: 0 test(s), Total: 24 test(s)
    Name: Tests.ObjectsAsMethods Failed: 0 test(s), Passed: 3 test(s), Skipped: 0 test(s), Total: 3 test(s)
    Name: Tests.PackageInfo Failed: 0 test(s), Passed: 1 test(s), Skipped: 0 test(s), Total: 1 test(s)
    Name: Tests.Polymorph.Widgets Failed: 0 test(s), Passed: 9 test(s), Skipped: 0 test(s), Total: 9 test(s)
    Name: Tests.Release Failed: 1 test(s), Passed: 2 test(s), Skipped: 0 test(s), Total: 3 test(s)
  • Failed: Tests.Release.ReleaseTest.testUndeclared
  • Name: Tests.ScriptLoader Failed: 0 test(s), Passed: 4 test(s), Skipped: 0 test(s), Total: 4 test(s)
    Name: Tests.System Failed: 0 test(s), Passed: 298 test(s), Skipped: 0 test(s), Total: 298 test(s)
    Name: Tests.SystemChangeNotification Failed: 0 test(s), Passed: 37 test(s), Skipped: 0 test(s), Total: 37 test(s)
    Name: Tests.SystemHistory Failed: 0 test(s), Passed: 14 test(s), Skipped: 0 test(s), Total: 14 test(s)
    Name: Tests.SystemSupport Failed: 0 test(s), Passed: 9 test(s), Skipped: 0 test(s), Total: 9 test(s)
    Name: Tests.TextEditors Failed: 0 test(s), Passed: 7 test(s), Skipped: 0 test(s), Total: 7 test(s)
    Name: Tests.Traits Failed: 0 test(s), Passed: 60 test(s), Skipped: 0 test(s), Total: 60 test(s)
    Name: Tests.Traits.MOP Failed: 0 test(s), Passed: 3 test(s), Skipped: 0 test(s), Total: 3 test(s)
    Name: Tests.VM Failed: 0 test(s), Passed: 10 test(s), Skipped: 0 test(s), Total: 10 test(s)
    Name: ToolsTest.Debugger Failed: 0 test(s), Passed: 10 test(s), Skipped: 0 test(s), Total: 10 test(s)
    Name: ToolsTest.Inspector Failed: 0 test(s), Passed: 1 test(s), Skipped: 0 test(s), Total: 1 test(s)
    Name: ToolsTest.MessageTally Failed: 0 test(s), Passed: 5 test(s), Skipped: 0 test(s), Total: 5 test(s)
    Name: ToolsTest.PointerFinder Failed: 0 test(s), Passed: 3 test(s), Skipped: 0 test(s), Total: 3 test(s)
    Name: Zinc.Tests Failed: 0 test(s), Passed: 201 test(s), Skipped: 0 test(s), Total: 201 test(s)

    Reply | Threaded
    Open this post in threaded view
    |  
    Report Content as Inappropriate

    Pharo 1.3 - Build # 24 - Still Unstable!

    jenkins-pharo.ci.inria.fr
    BUILD UNSTABLE
    Build URLhttps://ci.lille.inria.fr/pharo/job/Pharo%201.3/24/
    Project:Pharo 1.3
    Date of build:Fri, 23 Mar 2012 18:19:00 +0100
    Build duration:20 min

    CHANGES
    No Changes

    BUILD ARTIFACTS
  • Pharo-1.3/Pharo-1.3.st
  • Pharo-1.3.changes
  • Pharo-1.3.image
  • Pharo-1.3.zip

  • JUnit Tests
    Name: AST.Tests.Core Failed: 0 test(s), Passed: 69 test(s), Skipped: 0 test(s), Total: 69 test(s)
    Name: AST.Tests.Semantic Failed: 0 test(s), Passed: 25 test(s), Skipped: 0 test(s), Total: 25 test(s)
    Name: Announcements.Tests.Core Failed: 0 test(s), Passed: 27 test(s), Skipped: 0 test(s), Total: 27 test(s)
    Name: AutomaticMethodCategorizer.Tests Failed: 0 test(s), Passed: 14 test(s), Skipped: 0 test(s), Total: 14 test(s)
    Name: AutomaticMethodCategorizerOB.Tests Failed: 0 test(s), Passed: 2 test(s), Skipped: 0 test(s), Total: 2 test(s)
    Name: Autotest.Tests.Core Failed: 0 test(s), Passed: 27 test(s), Skipped: 0 test(s), Total: 27 test(s)
    Name: Autotest.Tests.GUI Failed: 0 test(s), Passed: 1 test(s), Skipped: 0 test(s), Total: 1 test(s)
    Name: Balloon.Collections.Tests Failed: 0 test(s), Passed: 34 test(s), Skipped: 0 test(s), Total: 34 test(s)
    Name: CollectionsTests.Arrayed Failed: 0 test(s), Passed: 562 test(s), Skipped: 0 test(s), Total: 562 test(s)
    Name: CollectionsTests.Atomic Failed: 0 test(s), Passed: 12 test(s), Skipped: 0 test(s), Total: 12 test(s)
    Name: CollectionsTests.Sequenceable Failed: 0 test(s), Passed: 912 test(s), Skipped: 0 test(s), Total: 912 test(s)
    Name: CollectionsTests.SplitJoin Failed: 0 test(s), Passed: 27 test(s), Skipped: 0 test(s), Total: 27 test(s)
    Name: CollectionsTests.Stack Failed: 0 test(s), Passed: 16 test(s), Skipped: 0 test(s), Total: 16 test(s)
    Name: CollectionsTests.Streams Failed: 0 test(s), Passed: 25 test(s), Skipped: 0 test(s), Total: 25 test(s)
    Name: CollectionsTests.Strings Failed: 0 test(s), Passed: 590 test(s), Skipped: 0 test(s), Total: 590 test(s)
    Name: CollectionsTests.Support Failed: 0 test(s), Passed: 12 test(s), Skipped: 0 test(s), Total: 12 test(s)
    Name: CollectionsTests.Text Failed: 0 test(s), Passed: 40 test(s), Skipped: 0 test(s), Total: 40 test(s)
    Name: CollectionsTests.Unordered Failed: 0 test(s), Passed: 1977 test(s), Skipped: 0 test(s), Total: 1977 test(s)
    Name: CollectionsTests.Weak Failed: 0 test(s), Passed: 751 test(s), Skipped: 0 test(s), Total: 751 test(s)
    Name: CompilerTests Failed: 0 test(s), Passed: 30 test(s), Skipped: 0 test(s), Total: 30 test(s)
    Name: CompressionTests.Archive Failed: 0 test(s), Passed: 2 test(s), Skipped: 0 test(s), Total: 2 test(s)
    Name: Finder.Tests Failed: 0 test(s), Passed: 9 test(s), Skipped: 0 test(s), Total: 9 test(s)
    Name: FreeTypeTests.cache Failed: 0 test(s), Passed: 23 test(s), Skipped: 0 test(s), Total: 23 test(s)
    Name: Gofer.Tests Failed: 0 test(s), Passed: 45 test(s), Skipped: 0 test(s), Total: 45 test(s)
    Name: Graphics.Tests.Files Failed: 0 test(s), Passed: 47 test(s), Skipped: 0 test(s), Total: 47 test(s)
    Name: Graphics.Tests.Primitives Failed: 0 test(s), Passed: 57 test(s), Skipped: 0 test(s), Total: 57 test(s)
    Name: Graphics.Tests.Text Failed: 0 test(s), Passed: 2 test(s), Skipped: 0 test(s), Total: 2 test(s)
    Name: HelpSystem.Tests.Builders Failed: 0 test(s), Passed: 5 test(s), Skipped: 0 test(s), Total: 5 test(s)
    Name: HelpSystem.Tests.Core.Model Failed: 0 test(s), Passed: 4 test(s), Skipped: 0 test(s), Total: 4 test(s)
    Name: HelpSystem.Tests.Core.UI Failed: 0 test(s), Passed: 6 test(s), Skipped: 0 test(s), Total: 6 test(s)
    Name: HelpSystem.Tests.Core.Utilities Failed: 0 test(s), Passed: 2 test(s), Skipped: 0 test(s), Total: 2 test(s)
    Name: KernelTests.Chronology Failed: 0 test(s), Passed: 575 test(s), Skipped: 0 test(s), Total: 575 test(s)
    Name: KernelTests.Classes Failed: 0 test(s), Passed: 60 test(s), Skipped: 0 test(s), Total: 60 test(s)
    Name: KernelTests.Exception Failed: 0 test(s), Passed: 2 test(s), Skipped: 0 test(s), Total: 2 test(s)
    Name: KernelTests.Methods Failed: 0 test(s), Passed: 188 test(s), Skipped: 0 test(s), Total: 188 test(s)
    Name: KernelTests.Numbers Failed: 0 test(s), Passed: 220 test(s), Skipped: 0 test(s), Total: 220 test(s)
    Name: KernelTests.Objects Failed: 0 test(s), Passed: 84 test(s), Skipped: 0 test(s), Total: 84 test(s)
    Name: KernelTests.Pragmas Failed: 0 test(s), Passed: 3 test(s), Skipped: 0 test(s), Total: 3 test(s)
    Name: KernelTests.Processes Failed: 0 test(s), Passed: 22 test(s), Skipped: 0 test(s), Total: 22 test(s)
    Name: LED.Test Failed: 0 test(s), Passed: 2 test(s), Skipped: 0 test(s), Total: 2 test(s)
    Name: Metacello.TestsCore Failed: 0 test(s), Passed: 44 test(s), Skipped: 0 test(s), Total: 44 test(s)
    Name: Metacello.TestsMC Failed: 0 test(s), Passed: 303 test(s), Skipped: 0 test(s), Total: 303 test(s)
    Name: Metacello.TestsPlatform Failed: 0 test(s), Passed: 1 test(s), Skipped: 0 test(s), Total: 1 test(s)
    Name: Metacello.TestsProfStef Failed: 0 test(s), Passed: 1 test(s), Skipped: 0 test(s), Total: 1 test(s)
    Name: Metacello.TestsReference Failed: 0 test(s), Passed: 2 test(s), Skipped: 0 test(s), Total: 2 test(s)
    Name: Metacello.TestsTutorial Failed: 0 test(s), Passed: 32 test(s), Skipped: 0 test(s), Total: 32 test(s)
    Name: MethodWrappers.Tests Failed: 0 test(s), Passed: 2 test(s), Skipped: 0 test(s), Total: 2 test(s)
    Name: MorphicTests.Basic Failed: 0 test(s), Passed: 16 test(s), Skipped: 0 test(s), Total: 16 test(s)
    Name: MorphicTests.Kernel Failed: 0 test(s), Passed: 8 test(s), Skipped: 0 test(s), Total: 8 test(s)
    Name: MorphicTests.Text Support Failed: 0 test(s), Passed: 14 test(s), Skipped: 0 test(s), Total: 14 test(s)
    Name: MorphicTests.Widgets Failed: 0 test(s), Passed: 5 test(s), Skipped: 0 test(s), Total: 5 test(s)
    Name: MorphicTests.WindowNotification Failed: 0 test(s), Passed: 7 test(s), Skipped: 0 test(s), Total: 7 test(s)
    Name: Multilingual.Tests.TextConversion Failed: 0 test(s), Passed: 7 test(s), Skipped: 0 test(s), Total: 7 test(s)
    Name: NetworkTests.Kernel Failed: 0 test(s), Passed: 31 test(s), Skipped: 0 test(s), Total: 31 test(s)
    Name: NetworkTests.MailMessage Failed: 0 test(s), Passed: 2 test(s), Skipped: 0 test(s), Total: 2 test(s)
    Name: NetworkTests.Protocols Failed: 0 test(s), Passed: 3 test(s), Skipped: 0 test(s), Total: 3 test(s)
    Name: NetworkTests.RFC822 Failed: 0 test(s), Passed: 1 test(s), Skipped: 0 test(s), Total: 1 test(s)
    Name: NetworkTests.URI Failed: 0 test(s), Passed: 105 test(s), Skipped: 0 test(s), Total: 105 test(s)
    Name: NetworkTests.UUID Failed: 0 test(s), Passed: 11 test(s), Skipped: 0 test(s), Total: 11 test(s)
    Name: NetworkTests.Url Failed: 0 test(s), Passed: 42 test(s), Skipped: 0 test(s), Total: 42 test(s)
    Name: OB.Fake.Tests Failed: 0 test(s), Passed: 10 test(s), Skipped: 0 test(s), Total: 10 test(s)
    Name: OB.Tests.Core Failed: 0 test(s), Passed: 89 test(s), Skipped: 0 test(s), Total: 89 test(s)
    Name: OB.Tests.Morphic Failed: 0 test(s), Passed: 24 test(s), Skipped: 0 test(s), Total: 24 test(s)
    Name: OB.Tests.Standard Failed: 0 test(s), Passed: 647 test(s), Skipped: 0 test(s), Total: 647 test(s)
    Name: OcompletionTests Failed: 14 test(s), Passed: 64 test(s), Skipped: 0 test(s), Total: 78 test(s)
  • Failed: OcompletionTests.ECInstVarTypeGuesserTest.testComplexInit
  • Failed: OcompletionTests.ECInstVarTypeGuesserTest.testComplexInit2
  • Failed: OcompletionTests.ECInstVarTypeGuesserTest.testConstantArray
  • Failed: OcompletionTests.ECInstVarTypeGuesserTest.testConstantBoolean
  • Failed: OcompletionTests.ECInstVarTypeGuesserTest.testConstantInteger
  • Failed: OcompletionTests.ECInstVarTypeGuesserTest.testConstantIntegerNil
  • Failed: OcompletionTests.ECInstVarTypeGuesserTest.testConstantString
  • Failed: OcompletionTests.ECInstVarTypeGuesserTest.testConstantSymbol
  • Failed: OcompletionTests.ECInstVarTypeGuesserTest.testGlobalVarKeyword
  • Failed: OcompletionTests.ECInstVarTypeGuesserTest.testGlobalVarKeyword2
  • Failed: OcompletionTests.ECInstVarTypeGuesserTest.testMessageSend
  • Failed: OcompletionTests.ECInstVarTypeGuesserTest.testMessageSend2
  • Failed: OcompletionTests.ECInstVarTypeGuesserTest.testSuperWithAnotherInit
  • Failed: OcompletionTests.ECInstVarTypeGuesserTest.testTypeSuggestingParameter
  • Name: ProfStef.Tests Failed: 0 test(s), Passed: 47 test(s), Skipped: 0 test(s), Total: 47 test(s)
    Name: Refactoring.Tests.Changes Failed: 0 test(s), Passed: 43 test(s), Skipped: 0 test(s), Total: 43 test(s)
    Name: Refactoring.Tests.Core Failed: 0 test(s), Passed: 215 test(s), Skipped: 0 test(s), Total: 215 test(s)
    Name: Refactoring.Tests.Critics Failed: 0 test(s), Passed: 57 test(s), Skipped: 0 test(s), Total: 57 test(s)
    Name: Refactoring.Tests.Environment Failed: 0 test(s), Passed: 20 test(s), Skipped: 0 test(s), Total: 20 test(s)
    Name: Refactoring.Tests.Spelling Failed: 0 test(s), Passed: 16 test(s), Skipped: 0 test(s), Total: 16 test(s)
    Name: Regex.Tests.Core Failed: 0 test(s), Passed: 188 test(s), Skipped: 0 test(s), Total: 188 test(s)
    Name: RoelTyper.Tests Failed: 0 test(s), Passed: 72 test(s), Skipped: 0 test(s), Total: 72 test(s)
    Name: SUnit.Core.Extensions Failed: 0 test(s), Passed: 3 test(s), Skipped: 0 test(s), Total: 3 test(s)
    Name: SUnit.Core.Utilities Failed: 0 test(s), Passed: 3 test(s), Skipped: 0 test(s), Total: 3 test(s)
    Name: SUnit.Tests.Core Failed: 0 test(s), Passed: 77 test(s), Skipped: 0 test(s), Total: 77 test(s)
    Name: ShoutTests.Parsing Failed: 0 test(s), Passed: 5 test(s), Skipped: 0 test(s), Total: 5 test(s)
    Name: StratifiedProxy.Tests Failed: 0 test(s), Passed: 2 test(s), Skipped: 0 test(s), Total: 2 test(s)
    Name: Tests.Browser Failed: 0 test(s), Passed: 7 test(s), Skipped: 0 test(s), Total: 7 test(s)
    Name: Tests.Bugs Failed: 0 test(s), Passed: 60 test(s), Skipped: 0 test(s), Total: 60 test(s)
    Name: Tests.Compiler Failed: 0 test(s), Passed: 71 test(s), Skipped: 0 test(s), Total: 71 test(s)
    Name: Tests.Compression Failed: 0 test(s), Passed: 9 test(s), Skipped: 0 test(s), Total: 9 test(s)
    Name: Tests.Digital Signatures Failed: 0 test(s), Passed: 8 test(s), Skipped: 0 test(s), Total: 8 test(s)
    Name: Tests.Exceptions Failed: 0 test(s), Passed: 28 test(s), Skipped: 0 test(s), Total: 28 test(s)
    Name: Tests.Files Failed: 0 test(s), Passed: 54 test(s), Skipped: 0 test(s), Total: 54 test(s)
    Name: Tests.Finalization Failed: 0 test(s), Passed: 1 test(s), Skipped: 0 test(s), Total: 1 test(s)
    Name: Tests.Localization Failed: 0 test(s), Passed: 1 test(s), Skipped: 0 test(s), Total: 1 test(s)
    Name: Tests.Monticello Failed: 0 test(s), Passed: 120 test(s), Skipped: 0 test(s), Total: 120 test(s)
    Name: Tests.Multilingual Failed: 0 test(s), Passed: 3 test(s), Skipped: 0 test(s), Total: 3 test(s)
    Name: Tests.Object Events Failed: 0 test(s), Passed: 24 test(s), Skipped: 0 test(s), Total: 24 test(s)
    Name: Tests.ObjectsAsMethods Failed: 0 test(s), Passed: 3 test(s), Skipped: 0 test(s), Total: 3 test(s)
    Name: Tests.PackageInfo Failed: 0 test(s), Passed: 1 test(s), Skipped: 0 test(s), Total: 1 test(s)
    Name: Tests.Polymorph.Widgets Failed: 0 test(s), Passed: 9 test(s), Skipped: 0 test(s), Total: 9 test(s)
    Name: Tests.Release Failed: 1 test(s), Passed: 2 test(s), Skipped: 0 test(s), Total: 3 test(s)
  • Failed: Tests.Release.ReleaseTest.testUndeclared
  • Name: Tests.ScriptLoader Failed: 0 test(s), Passed: 4 test(s), Skipped: 0 test(s), Total: 4 test(s)
    Name: Tests.System Failed: 0 test(s), Passed: 298 test(s), Skipped: 0 test(s), Total: 298 test(s)
    Name: Tests.SystemChangeNotification Failed: 0 test(s), Passed: 37 test(s), Skipped: 0 test(s), Total: 37 test(s)
    Name: Tests.SystemHistory Failed: 0 test(s), Passed: 14 test(s), Skipped: 0 test(s), Total: 14 test(s)
    Name: Tests.SystemSupport Failed: 0 test(s), Passed: 9 test(s), Skipped: 0 test(s), Total: 9 test(s)
    Name: Tests.TextEditors Failed: 0 test(s), Passed: 7 test(s), Skipped: 0 test(s), Total: 7 test(s)
    Name: Tests.Traits Failed: 0 test(s), Passed: 60 test(s), Skipped: 0 test(s), Total: 60 test(s)
    Name: Tests.Traits.MOP Failed: 0 test(s), Passed: 3 test(s), Skipped: 0 test(s), Total: 3 test(s)
    Name: Tests.VM Failed: 0 test(s), Passed: 10 test(s), Skipped: 0 test(s), Total: 10 test(s)
    Name: ToolsTest.Debugger Failed: 0 test(s), Passed: 10 test(s), Skipped: 0 test(s), Total: 10 test(s)
    Name: ToolsTest.Inspector Failed: 0 test(s), Passed: 1 test(s), Skipped: 0 test(s), Total: 1 test(s)
    Name: ToolsTest.MessageTally Failed: 0 test(s), Passed: 5 test(s), Skipped: 0 test(s), Total: 5 test(s)
    Name: ToolsTest.PointerFinder Failed: 0 test(s), Passed: 3 test(s), Skipped: 0 test(s), Total: 3 test(s)
    Name: Zinc.Tests Failed: 0 test(s), Passed: 201 test(s), Skipped: 0 test(s), Total: 201 test(s)

    Reply | Threaded
    Open this post in threaded view
    |  
    Report Content as Inappropriate

    Pharo 1.3 - Build # 25 - Still Unstable!

    jenkins-pharo.ci.inria.fr
    BUILD UNSTABLE
    Build URLhttps://ci.lille.inria.fr/pharo/job/Pharo%201.3/25/
    Project:Pharo 1.3
    Date of build:Mon, 26 Mar 2012 20:51:05 +0200
    Build duration:20 min

    CHANGES
    No Changes

    BUILD ARTIFACTS
  • Pharo-1.3/Pharo-1.3.st
  • Pharo-1.3.changes
  • Pharo-1.3.image
  • Pharo-1.3.zip

  • JUnit Tests
    Name: AST.Tests.Core Failed: 0 test(s), Passed: 69 test(s), Skipped: 0 test(s), Total: 69 test(s)
    Name: AST.Tests.Semantic Failed: 0 test(s), Passed: 25 test(s), Skipped: 0 test(s), Total: 25 test(s)
    Name: Announcements.Tests.Core Failed: 0 test(s), Passed: 27 test(s), Skipped: 0 test(s), Total: 27 test(s)
    Name: AutomaticMethodCategorizer.Tests Failed: 0 test(s), Passed: 14 test(s), Skipped: 0 test(s), Total: 14 test(s)
    Name: AutomaticMethodCategorizerOB.Tests Failed: 0 test(s), Passed: 2 test(s), Skipped: 0 test(s), Total: 2 test(s)
    Name: Autotest.Tests.Core Failed: 0 test(s), Passed: 27 test(s), Skipped: 0 test(s), Total: 27 test(s)
    Name: Autotest.Tests.GUI Failed: 0 test(s), Passed: 1 test(s), Skipped: 0 test(s), Total: 1 test(s)
    Name: Balloon.Collections.Tests Failed: 0 test(s), Passed: 34 test(s), Skipped: 0 test(s), Total: 34 test(s)
    Name: CollectionsTests.Arrayed Failed: 0 test(s), Passed: 562 test(s), Skipped: 0 test(s), Total: 562 test(s)
    Name: CollectionsTests.Atomic Failed: 0 test(s), Passed: 12 test(s), Skipped: 0 test(s), Total: 12 test(s)
    Name: CollectionsTests.Sequenceable Failed: 0 test(s), Passed: 912 test(s), Skipped: 0 test(s), Total: 912 test(s)
    Name: CollectionsTests.SplitJoin Failed: 0 test(s), Passed: 27 test(s), Skipped: 0 test(s), Total: 27 test(s)
    Name: CollectionsTests.Stack Failed: 0 test(s), Passed: 16 test(s), Skipped: 0 test(s), Total: 16 test(s)
    Name: CollectionsTests.Streams Failed: 0 test(s), Passed: 25 test(s), Skipped: 0 test(s), Total: 25 test(s)
    Name: CollectionsTests.Strings Failed: 0 test(s), Passed: 590 test(s), Skipped: 0 test(s), Total: 590 test(s)
    Name: CollectionsTests.Support Failed: 0 test(s), Passed: 12 test(s), Skipped: 0 test(s), Total: 12 test(s)
    Name: CollectionsTests.Text Failed: 0 test(s), Passed: 40 test(s), Skipped: 0 test(s), Total: 40 test(s)
    Name: CollectionsTests.Unordered Failed: 0 test(s), Passed: 1977 test(s), Skipped: 0 test(s), Total: 1977 test(s)
    Name: CollectionsTests.Weak Failed: 0 test(s), Passed: 751 test(s), Skipped: 0 test(s), Total: 751 test(s)
    Name: CompilerTests Failed: 0 test(s), Passed: 30 test(s), Skipped: 0 test(s), Total: 30 test(s)
    Name: CompressionTests.Archive Failed: 0 test(s), Passed: 2 test(s), Skipped: 0 test(s), Total: 2 test(s)
    Name: Finder.Tests Failed: 0 test(s), Passed: 9 test(s), Skipped: 0 test(s), Total: 9 test(s)
    Name: FreeTypeTests.cache Failed: 0 test(s), Passed: 23 test(s), Skipped: 0 test(s), Total: 23 test(s)
    Name: Gofer.Tests Failed: 0 test(s), Passed: 45 test(s), Skipped: 0 test(s), Total: 45 test(s)
    Name: Graphics.Tests.Files Failed: 0 test(s), Passed: 47 test(s), Skipped: 0 test(s), Total: 47 test(s)
    Name: Graphics.Tests.Primitives Failed: 0 test(s), Passed: 57 test(s), Skipped: 0 test(s), Total: 57 test(s)
    Name: Graphics.Tests.Text Failed: 0 test(s), Passed: 2 test(s), Skipped: 0 test(s), Total: 2 test(s)
    Name: HelpSystem.Tests.Builders Failed: 0 test(s), Passed: 5 test(s), Skipped: 0 test(s), Total: 5 test(s)
    Name: HelpSystem.Tests.Core.Model Failed: 0 test(s), Passed: 4 test(s), Skipped: 0 test(s), Total: 4 test(s)
    Name: HelpSystem.Tests.Core.UI Failed: 0 test(s), Passed: 6 test(s), Skipped: 0 test(s), Total: 6 test(s)
    Name: HelpSystem.Tests.Core.Utilities Failed: 0 test(s), Passed: 2 test(s), Skipped: 0 test(s), Total: 2 test(s)
    Name: KernelTests.Chronology Failed: 0 test(s), Passed: 575 test(s), Skipped: 0 test(s), Total: 575 test(s)
    Name: KernelTests.Classes Failed: 0 test(s), Passed: 60 test(s), Skipped: 0 test(s), Total: 60 test(s)
    Name: KernelTests.Exception Failed: 0 test(s), Passed: 2 test(s), Skipped: 0 test(s), Total: 2 test(s)
    Name: KernelTests.Methods Failed: 0 test(s), Passed: 188 test(s), Skipped: 0 test(s), Total: 188 test(s)
    Name: KernelTests.Numbers Failed: 0 test(s), Passed: 220 test(s), Skipped: 0 test(s), Total: 220 test(s)
    Name: KernelTests.Objects Failed: 0 test(s), Passed: 84 test(s), Skipped: 0 test(s), Total: 84 test(s)
    Name: KernelTests.Pragmas Failed: 0 test(s), Passed: 3 test(s), Skipped: 0 test(s), Total: 3 test(s)
    Name: KernelTests.Processes Failed: 0 test(s), Passed: 22 test(s), Skipped: 0 test(s), Total: 22 test(s)
    Name: LED.Test Failed: 0 test(s), Passed: 2 test(s), Skipped: 0 test(s), Total: 2 test(s)
    Name: Metacello.TestsCore Failed: 0 test(s), Passed: 44 test(s), Skipped: 0 test(s), Total: 44 test(s)
    Name: Metacello.TestsMC Failed: 0 test(s), Passed: 303 test(s), Skipped: 0 test(s), Total: 303 test(s)
    Name: Metacello.TestsPlatform Failed: 0 test(s), Passed: 1 test(s), Skipped: 0 test(s), Total: 1 test(s)
    Name: Metacello.TestsProfStef Failed: 0 test(s), Passed: 1 test(s), Skipped: 0 test(s), Total: 1 test(s)
    Name: Metacello.TestsReference Failed: 0 test(s), Passed: 2 test(s), Skipped: 0 test(s), Total: 2 test(s)
    Name: Metacello.TestsTutorial Failed: 0 test(s), Passed: 32 test(s), Skipped: 0 test(s), Total: 32 test(s)
    Name: MethodWrappers.Tests Failed: 0 test(s), Passed: 2 test(s), Skipped: 0 test(s), Total: 2 test(s)
    Name: MorphicTests.Basic Failed: 0 test(s), Passed: 16 test(s), Skipped: 0 test(s), Total: 16 test(s)
    Name: MorphicTests.Kernel Failed: 0 test(s), Passed: 8 test(s), Skipped: 0 test(s), Total: 8 test(s)
    Name: MorphicTests.Text Support Failed: 0 test(s), Passed: 14 test(s), Skipped: 0 test(s), Total: 14 test(s)
    Name: MorphicTests.Widgets Failed: 0 test(s), Passed: 5 test(s), Skipped: 0 test(s), Total: 5 test(s)
    Name: MorphicTests.WindowNotification Failed: 0 test(s), Passed: 7 test(s), Skipped: 0 test(s), Total: 7 test(s)
    Name: Multilingual.Tests.TextConversion Failed: 0 test(s), Passed: 7 test(s), Skipped: 0 test(s), Total: 7 test(s)
    Name: NetworkTests.Kernel Failed: 0 test(s), Passed: 31 test(s), Skipped: 0 test(s), Total: 31 test(s)
    Name: NetworkTests.MailMessage Failed: 0 test(s), Passed: 2 test(s), Skipped: 0 test(s), Total: 2 test(s)
    Name: NetworkTests.Protocols Failed: 0 test(s), Passed: 3 test(s), Skipped: 0 test(s), Total: 3 test(s)
    Name: NetworkTests.RFC822 Failed: 0 test(s), Passed: 1 test(s), Skipped: 0 test(s), Total: 1 test(s)
    Name: NetworkTests.URI Failed: 0 test(s), Passed: 105 test(s), Skipped: 0 test(s), Total: 105 test(s)
    Name: NetworkTests.UUID Failed: 0 test(s), Passed: 11 test(s), Skipped: 0 test(s), Total: 11 test(s)
    Name: NetworkTests.Url Failed: 0 test(s), Passed: 42 test(s), Skipped: 0 test(s), Total: 42 test(s)
    Name: OB.Fake.Tests Failed: 0 test(s), Passed: 10 test(s), Skipped: 0 test(s), Total: 10 test(s)
    Name: OB.Tests.Core Failed: 0 test(s), Passed: 89 test(s), Skipped: 0 test(s), Total: 89 test(s)
    Name: OB.Tests.Morphic Failed: 0 test(s), Passed: 24 test(s), Skipped: 0 test(s), Total: 24 test(s)
    Name: OB.Tests.Standard Failed: 0 test(s), Passed: 647 test(s), Skipped: 0 test(s), Total: 647 test(s)
    Name: OcompletionTests Failed: 14 test(s), Passed: 64 test(s), Skipped: 0 test(s), Total: 78 test(s)
  • Failed: OcompletionTests.ECInstVarTypeGuesserTest.testComplexInit
  • Failed: OcompletionTests.ECInstVarTypeGuesserTest.testComplexInit2
  • Failed: OcompletionTests.ECInstVarTypeGuesserTest.testConstantArray
  • Failed: OcompletionTests.ECInstVarTypeGuesserTest.testConstantBoolean
  • Failed: OcompletionTests.ECInstVarTypeGuesserTest.testConstantInteger
  • Failed: OcompletionTests.ECInstVarTypeGuesserTest.testConstantIntegerNil
  • Failed: OcompletionTests.ECInstVarTypeGuesserTest.testConstantString
  • Failed: OcompletionTests.ECInstVarTypeGuesserTest.testConstantSymbol
  • Failed: OcompletionTests.ECInstVarTypeGuesserTest.testGlobalVarKeyword
  • Failed: OcompletionTests.ECInstVarTypeGuesserTest.testGlobalVarKeyword2
  • Failed: OcompletionTests.ECInstVarTypeGuesserTest.testMessageSend
  • Failed: OcompletionTests.ECInstVarTypeGuesserTest.testMessageSend2
  • Failed: OcompletionTests.ECInstVarTypeGuesserTest.testSuperWithAnotherInit
  • Failed: OcompletionTests.ECInstVarTypeGuesserTest.testTypeSuggestingParameter
  • Name: ProfStef.Tests Failed: 0 test(s), Passed: 47 test(s), Skipped: 0 test(s), Total: 47 test(s)
    Name: Refactoring.Tests.Changes Failed: 0 test(s), Passed: 43 test(s), Skipped: 0 test(s), Total: 43 test(s)
    Name: Refactoring.Tests.Core Failed: 0 test(s), Passed: 215 test(s), Skipped: 0 test(s), Total: 215 test(s)
    Name: Refactoring.Tests.Critics Failed: 0 test(s), Passed: 57 test(s), Skipped: 0 test(s), Total: 57 test(s)
    Name: Refactoring.Tests.Environment Failed: 0 test(s), Passed: 20 test(s), Skipped: 0 test(s), Total: 20 test(s)
    Name: Refactoring.Tests.Spelling Failed: 0 test(s), Passed: 16 test(s), Skipped: 0 test(s), Total: 16 test(s)
    Name: Regex.Tests.Core Failed: 0 test(s), Passed: 188 test(s), Skipped: 0 test(s), Total: 188 test(s)
    Name: RoelTyper.Tests Failed: 0 test(s), Passed: 72 test(s), Skipped: 0 test(s), Total: 72 test(s)
    Name: SUnit.Core.Extensions Failed: 0 test(s), Passed: 3 test(s), Skipped: 0 test(s), Total: 3 test(s)
    Name: SUnit.Core.Utilities Failed: 0 test(s), Passed: 3 test(s), Skipped: 0 test(s), Total: 3 test(s)
    Name: SUnit.Tests.Core Failed: 0 test(s), Passed: 77 test(s), Skipped: 0 test(s), Total: 77 test(s)
    Name: ShoutTests.Parsing Failed: 0 test(s), Passed: 5 test(s), Skipped: 0 test(s), Total: 5 test(s)
    Name: StratifiedProxy.Tests Failed: 0 test(s), Passed: 2 test(s), Skipped: 0 test(s), Total: 2 test(s)
    Name: Tests.Browser Failed: 0 test(s), Passed: 7 test(s), Skipped: 0 test(s), Total: 7 test(s)
    Name: Tests.Bugs Failed: 0 test(s), Passed: 60 test(s), Skipped: 0 test(s), Total: 60 test(s)
    Name: Tests.Compiler Failed: 0 test(s), Passed: 71 test(s), Skipped: 0 test(s), Total: 71 test(s)
    Name: Tests.Compression Failed: 0 test(s), Passed: 9 test(s), Skipped: 0 test(s), Total: 9 test(s)
    Name: Tests.Digital Signatures Failed: 0 test(s), Passed: 8 test(s), Skipped: 0 test(s), Total: 8 test(s)
    Name: Tests.Exceptions Failed: 0 test(s), Passed: 28 test(s), Skipped: 0 test(s), Total: 28 test(s)
    Name: Tests.Files Failed: 0 test(s), Passed: 54 test(s), Skipped: 0 test(s), Total: 54 test(s)
    Name: Tests.Finalization Failed: 0 test(s), Passed: 1 test(s), Skipped: 0 test(s), Total: 1 test(s)
    Name: Tests.Localization Failed: 0 test(s), Passed: 1 test(s), Skipped: 0 test(s), Total: 1 test(s)
    Name: Tests.Monticello Failed: 0 test(s), Passed: 120 test(s), Skipped: 0 test(s), Total: 120 test(s)
    Name: Tests.Multilingual Failed: 0 test(s), Passed: 3 test(s), Skipped: 0 test(s), Total: 3 test(s)
    Name: Tests.Object Events Failed: 0 test(s), Passed: 24 test(s), Skipped: 0 test(s), Total: 24 test(s)
    Name: Tests.ObjectsAsMethods Failed: 0 test(s), Passed: 3 test(s), Skipped: 0 test(s), Total: 3 test(s)
    Name: Tests.PackageInfo Failed: 0 test(s), Passed: 1 test(s), Skipped: 0 test(s), Total: 1 test(s)
    Name: Tests.Polymorph.Widgets Failed: 0 test(s), Passed: 9 test(s), Skipped: 0 test(s), Total: 9 test(s)
    Name: Tests.Release Failed: 1 test(s), Passed: 2 test(s), Skipped: 0 test(s), Total: 3 test(s)
  • Failed: Tests.Release.ReleaseTest.testUndeclared
  • Name: Tests.ScriptLoader Failed: 0 test(s), Passed: 4 test(s), Skipped: 0 test(s), Total: 4 test(s)
    Name: Tests.System Failed: 0 test(s), Passed: 298 test(s), Skipped: 0 test(s), Total: 298 test(s)
    Name: Tests.SystemChangeNotification Failed: 0 test(s), Passed: 37 test(s), Skipped: 0 test(s), Total: 37 test(s)
    Name: Tests.SystemHistory Failed: 0 test(s), Passed: 14 test(s), Skipped: 0 test(s), Total: 14 test(s)
    Name: Tests.SystemSupport Failed: 0 test(s), Passed: 9 test(s), Skipped: 0 test(s), Total: 9 test(s)
    Name: Tests.TextEditors Failed: 0 test(s), Passed: 7 test(s), Skipped: 0 test(s), Total: 7 test(s)
    Name: Tests.Traits Failed: 0 test(s), Passed: 60 test(s), Skipped: 0 test(s), Total: 60 test(s)
    Name: Tests.Traits.MOP Failed: 0 test(s), Passed: 3 test(s), Skipped: 0 test(s), Total: 3 test(s)
    Name: Tests.VM Failed: 0 test(s), Passed: 10 test(s), Skipped: 0 test(s), Total: 10 test(s)
    Name: ToolsTest.Debugger Failed: 0 test(s), Passed: 10 test(s), Skipped: 0 test(s), Total: 10 test(s)
    Name: ToolsTest.Inspector Failed: 0 test(s), Passed: 1 test(s), Skipped: 0 test(s), Total: 1 test(s)
    Name: ToolsTest.MessageTally Failed: 0 test(s), Passed: 5 test(s), Skipped: 0 test(s), Total: 5 test(s)
    Name: ToolsTest.PointerFinder Failed: 0 test(s), Passed: 3 test(s), Skipped: 0 test(s), Total: 3 test(s)
    Name: Zinc.Tests Failed: 0 test(s), Passed: 201 test(s), Skipped: 0 test(s), Total: 201 test(s)

    Reply | Threaded
    Open this post in threaded view
    |  
    Report Content as Inappropriate

    Pharo 1.3 - Build # 26 - Still Unstable!

    jenkins-pharo.ci.inria.fr
    BUILD UNSTABLE
    Build URLhttps://ci.lille.inria.fr/pharo/job/Pharo%201.3/26/
    Project:Pharo 1.3
    Date of build:Tue, 27 Mar 2012 17:05:56 +0200
    Build duration:19 min

    CHANGES
    No Changes

    BUILD ARTIFACTS
  • Pharo-1.3/Pharo-1.3.st
  • Pharo-1.3.changes
  • Pharo-1.3.image
  • Pharo-1.3.zip

  • JUnit Tests
    Name: AST.Tests.Core Failed: 0 test(s), Passed: 69 test(s), Skipped: 0 test(s), Total: 69 test(s)
    Name: AST.Tests.Semantic Failed: 0 test(s), Passed: 25 test(s), Skipped: 0 test(s), Total: 25 test(s)
    Name: Announcements.Tests.Core Failed: 0 test(s), Passed: 27 test(s), Skipped: 0 test(s), Total: 27 test(s)
    Name: AutomaticMethodCategorizer.Tests Failed: 0 test(s), Passed: 14 test(s), Skipped: 0 test(s), Total: 14 test(s)
    Name: AutomaticMethodCategorizerOB.Tests Failed: 0 test(s), Passed: 2 test(s), Skipped: 0 test(s), Total: 2 test(s)
    Name: Autotest.Tests.Core Failed: 0 test(s), Passed: 27 test(s), Skipped: 0 test(s), Total: 27 test(s)
    Name: Autotest.Tests.GUI Failed: 0 test(s), Passed: 1 test(s), Skipped: 0 test(s), Total: 1 test(s)
    Name: Balloon.Collections.Tests Failed: 0 test(s), Passed: 34 test(s), Skipped: 0 test(s), Total: 34 test(s)
    Name: CollectionsTests.Arrayed Failed: 0 test(s), Passed: 562 test(s), Skipped: 0 test(s), Total: 562 test(s)
    Name: CollectionsTests.Atomic Failed: 0 test(s), Passed: 12 test(s), Skipped: 0 test(s), Total: 12 test(s)
    Name: CollectionsTests.Sequenceable Failed: 0 test(s), Passed: 912 test(s), Skipped: 0 test(s), Total: 912 test(s)
    Name: CollectionsTests.SplitJoin Failed: 0 test(s), Passed: 27 test(s), Skipped: 0 test(s), Total: 27 test(s)
    Name: CollectionsTests.Stack Failed: 0 test(s), Passed: 16 test(s), Skipped: 0 test(s), Total: 16 test(s)
    Name: CollectionsTests.Streams Failed: 0 test(s), Passed: 25 test(s), Skipped: 0 test(s), Total: 25 test(s)
    Name: CollectionsTests.Strings Failed: 0 test(s), Passed: 590 test(s), Skipped: 0 test(s), Total: 590 test(s)
    Name: CollectionsTests.Support Failed: 0 test(s), Passed: 12 test(s), Skipped: 0 test(s), Total: 12 test(s)
    Name: CollectionsTests.Text Failed: 0 test(s), Passed: 40 test(s), Skipped: 0 test(s), Total: 40 test(s)
    Name: CollectionsTests.Unordered Failed: 0 test(s), Passed: 1977 test(s), Skipped: 0 test(s), Total: 1977 test(s)
    Name: CollectionsTests.Weak Failed: 0 test(s), Passed: 751 test(s), Skipped: 0 test(s), Total: 751 test(s)
    Name: CompilerTests Failed: 0 test(s), Passed: 30 test(s), Skipped: 0 test(s), Total: 30 test(s)
    Name: CompressionTests.Archive Failed: 0 test(s), Passed: 2 test(s), Skipped: 0 test(s), Total: 2 test(s)
    Name: Finder.Tests Failed: 0 test(s), Passed: 9 test(s), Skipped: 0 test(s), Total: 9 test(s)
    Name: FreeTypeTests.cache Failed: 0 test(s), Passed: 23 test(s), Skipped: 0 test(s), Total: 23 test(s)
    Name: Gofer.Tests Failed: 0 test(s), Passed: 45 test(s), Skipped: 0 test(s), Total: 45 test(s)
    Name: Graphics.Tests.Files Failed: 0 test(s), Passed: 47 test(s), Skipped: 0 test(s), Total: 47 test(s)
    Name: Graphics.Tests.Primitives Failed: 0 test(s), Passed: 57 test(s), Skipped: 0 test(s), Total: 57 test(s)
    Name: Graphics.Tests.Text Failed: 0 test(s), Passed: 2 test(s), Skipped: 0 test(s), Total: 2 test(s)
    Name: HelpSystem.Tests.Builders Failed: 0 test(s), Passed: 5 test(s), Skipped: 0 test(s), Total: 5 test(s)
    Name: HelpSystem.Tests.Core.Model Failed: 0 test(s), Passed: 4 test(s), Skipped: 0 test(s), Total: 4 test(s)
    Name: HelpSystem.Tests.Core.UI Failed: 0 test(s), Passed: 6 test(s), Skipped: 0 test(s), Total: 6 test(s)
    Name: HelpSystem.Tests.Core.Utilities Failed: 0 test(s), Passed: 2 test(s), Skipped: 0 test(s), Total: 2 test(s)
    Name: KernelTests.Chronology Failed: 0 test(s), Passed: 575 test(s), Skipped: 0 test(s), Total: 575 test(s)
    Name: KernelTests.Classes Failed: 0 test(s), Passed: 60 test(s), Skipped: 0 test(s), Total: 60 test(s)
    Name: KernelTests.Exception Failed: 0 test(s), Passed: 2 test(s), Skipped: 0 test(s), Total: 2 test(s)
    Name: KernelTests.Methods Failed: 0 test(s), Passed: 188 test(s), Skipped: 0 test(s), Total: 188 test(s)
    Name: KernelTests.Numbers Failed: 0 test(s), Passed: 220 test(s), Skipped: 0 test(s), Total: 220 test(s)
    Name: KernelTests.Objects Failed: 0 test(s), Passed: 84 test(s), Skipped: 0 test(s), Total: 84 test(s)
    Name: KernelTests.Pragmas Failed: 0 test(s), Passed: 3 test(s), Skipped: 0 test(s), Total: 3 test(s)
    Name: KernelTests.Processes Failed: 0 test(s), Passed: 22 test(s), Skipped: 0 test(s), Total: 22 test(s)
    Name: LED.Test Failed: 0 test(s), Passed: 2 test(s), Skipped: 0 test(s), Total: 2 test(s)
    Name: Metacello.TestsCore Failed: 0 test(s), Passed: 44 test(s), Skipped: 0 test(s), Total: 44 test(s)
    Name: Metacello.TestsMC Failed: 0 test(s), Passed: 303 test(s), Skipped: 0 test(s), Total: 303 test(s)
    Name: Metacello.TestsPlatform Failed: 0 test(s), Passed: 1 test(s), Skipped: 0 test(s), Total: 1 test(s)
    Name: Metacello.TestsProfStef Failed: 0 test(s), Passed: 1 test(s), Skipped: 0 test(s), Total: 1 test(s)
    Name: Metacello.TestsReference Failed: 0 test(s), Passed: 2 test(s), Skipped: 0 test(s), Total: 2 test(s)
    Name: Metacello.TestsTutorial Failed: 0 test(s), Passed: 32 test(s), Skipped: 0 test(s), Total: 32 test(s)
    Name: MethodWrappers.Tests Failed: 0 test(s), Passed: 2 test(s), Skipped: 0 test(s), Total: 2 test(s)
    Name: MorphicTests.Basic Failed: 0 test(s), Passed: 16 test(s), Skipped: 0 test(s), Total: 16 test(s)
    Name: MorphicTests.Kernel Failed: 0 test(s), Passed: 8 test(s), Skipped: 0 test(s), Total: 8 test(s)
    Name: MorphicTests.Text Support Failed: 0 test(s), Passed: 14 test(s), Skipped: 0 test(s), Total: 14 test(s)
    Name: MorphicTests.Widgets Failed: 0 test(s), Passed: 5 test(s), Skipped: 0 test(s), Total: 5 test(s)
    Name: MorphicTests.WindowNotification Failed: 0 test(s), Passed: 7 test(s), Skipped: 0 test(s), Total: 7 test(s)
    Name: Multilingual.Tests.TextConversion Failed: 0 test(s), Passed: 7 test(s), Skipped: 0 test(s), Total: 7 test(s)
    Name: NetworkTests.Kernel Failed: 0 test(s), Passed: 31 test(s), Skipped: 0 test(s), Total: 31 test(s)
    Name: NetworkTests.MailMessage Failed: 0 test(s), Passed: 2 test(s), Skipped: 0 test(s), Total: 2 test(s)
    Name: NetworkTests.Protocols Failed: 0 test(s), Passed: 3 test(s), Skipped: 0 test(s), Total: 3 test(s)
    Name: NetworkTests.RFC822 Failed: 0 test(s), Passed: 1 test(s), Skipped: 0 test(s), Total: 1 test(s)
    Name: NetworkTests.URI Failed: 0 test(s), Passed: 105 test(s), Skipped: 0 test(s), Total: 105 test(s)
    Name: NetworkTests.UUID Failed: 0 test(s), Passed: 11 test(s), Skipped: 0 test(s), Total: 11 test(s)
    Name: NetworkTests.Url Failed: 0 test(s), Passed: 42 test(s), Skipped: 0 test(s), Total: 42 test(s)
    Name: OB.Fake.Tests Failed: 0 test(s), Passed: 10 test(s), Skipped: 0 test(s), Total: 10 test(s)
    Name: OB.Tests.Core Failed: 0 test(s), Passed: 89 test(s), Skipped: 0 test(s), Total: 89 test(s)
    Name: OB.Tests.Morphic Failed: 0 test(s), Passed: 24 test(s), Skipped: 0 test(s), Total: 24 test(s)
    Name: OB.Tests.Standard Failed: 0 test(s), Passed: 647 test(s), Skipped: 0 test(s), Total: 647 test(s)
    Name: OcompletionTests Failed: 14 test(s), Passed: 64 test(s), Skipped: 0 test(s), Total: 78 test(s)
  • Failed: OcompletionTests.ECInstVarTypeGuesserTest.testComplexInit
  • Failed: OcompletionTests.ECInstVarTypeGuesserTest.testComplexInit2
  • Failed: OcompletionTests.ECInstVarTypeGuesserTest.testConstantArray
  • Failed: OcompletionTests.ECInstVarTypeGuesserTest.testConstantBoolean
  • Failed: OcompletionTests.ECInstVarTypeGuesserTest.testConstantInteger
  • Failed: OcompletionTests.ECInstVarTypeGuesserTest.testConstantIntegerNil
  • Failed: OcompletionTests.ECInstVarTypeGuesserTest.testConstantString
  • Failed: OcompletionTests.ECInstVarTypeGuesserTest.testConstantSymbol
  • Failed: OcompletionTests.ECInstVarTypeGuesserTest.testGlobalVarKeyword
  • Failed: OcompletionTests.ECInstVarTypeGuesserTest.testGlobalVarKeyword2
  • Failed: OcompletionTests.ECInstVarTypeGuesserTest.testMessageSend
  • Failed: OcompletionTests.ECInstVarTypeGuesserTest.testMessageSend2
  • Failed: OcompletionTests.ECInstVarTypeGuesserTest.testSuperWithAnotherInit
  • Failed: OcompletionTests.ECInstVarTypeGuesserTest.testTypeSuggestingParameter
  • Name: ProfStef.Tests Failed: 0 test(s), Passed: 47 test(s), Skipped: 0 test(s), Total: 47 test(s)
    Name: Refactoring.Tests.Changes Failed: 0 test(s), Passed: 43 test(s), Skipped: 0 test(s), Total: 43 test(s)
    Name: Refactoring.Tests.Core Failed: 0 test(s), Passed: 215 test(s), Skipped: 0 test(s), Total: 215 test(s)
    Name: Refactoring.Tests.Critics Failed: 0 test(s), Passed: 57 test(s), Skipped: 0 test(s), Total: 57 test(s)
    Name: Refactoring.Tests.Environment Failed: 0 test(s), Passed: 20 test(s), Skipped: 0 test(s), Total: 20 test(s)
    Name: Refactoring.Tests.Spelling Failed: 0 test(s), Passed: 16 test(s), Skipped: 0 test(s), Total: 16 test(s)
    Name: Regex.Tests.Core Failed: 0 test(s), Passed: 188 test(s), Skipped: 0 test(s), Total: 188 test(s)
    Name: RoelTyper.Tests Failed: 0 test(s), Passed: 72 test(s), Skipped: 0 test(s), Total: 72 test(s)
    Name: SUnit.Core.Extensions Failed: 0 test(s), Passed: 3 test(s), Skipped: 0 test(s), Total: 3 test(s)
    Name: SUnit.Core.Utilities Failed: 0 test(s), Passed: 3 test(s), Skipped: 0 test(s), Total: 3 test(s)
    Name: SUnit.Tests.Core Failed: 0 test(s), Passed: 77 test(s), Skipped: 0 test(s), Total: 77 test(s)
    Name: ShoutTests.Parsing Failed: 0 test(s), Passed: 5 test(s), Skipped: 0 test(s), Total: 5 test(s)
    Name: StratifiedProxy.Tests Failed: 0 test(s), Passed: 2 test(s), Skipped: 0 test(s), Total: 2 test(s)
    Name: Tests.Browser Failed: 0 test(s), Passed: 7 test(s), Skipped: 0 test(s), Total: 7 test(s)
    Name: Tests.Bugs Failed: 0 test(s), Passed: 60 test(s), Skipped: 0 test(s), Total: 60 test(s)
    Name: Tests.Compiler Failed: 0 test(s), Passed: 71 test(s), Skipped: 0 test(s), Total: 71 test(s)
    Name: Tests.Compression Failed: 0 test(s), Passed: 9 test(s), Skipped: 0 test(s), Total: 9 test(s)
    Name: Tests.Digital Signatures Failed: 0 test(s), Passed: 8 test(s), Skipped: 0 test(s), Total: 8 test(s)
    Name: Tests.Exceptions Failed: 0 test(s), Passed: 28 test(s), Skipped: 0 test(s), Total: 28 test(s)
    Name: Tests.Files Failed: 0 test(s), Passed: 54 test(s), Skipped: 0 test(s), Total: 54 test(s)
    Name: Tests.Finalization Failed: 0 test(s), Passed: 1 test(s), Skipped: 0 test(s), Total: 1 test(s)
    Name: Tests.Localization Failed: 0 test(s), Passed: 1 test(s), Skipped: 0 test(s), Total: 1 test(s)
    Name: Tests.Monticello Failed: 0 test(s), Passed: 120 test(s), Skipped: 0 test(s), Total: 120 test(s)
    Name: Tests.Multilingual Failed: 0 test(s), Passed: 3 test(s), Skipped: 0 test(s), Total: 3 test(s)
    Name: Tests.Object Events Failed: 0 test(s), Passed: 24 test(s), Skipped: 0 test(s), Total: 24 test(s)
    Name: Tests.ObjectsAsMethods Failed: 0 test(s), Passed: 3 test(s), Skipped: 0 test(s), Total: 3 test(s)
    Name: Tests.PackageInfo Failed: 0 test(s), Passed: 1 test(s), Skipped: 0 test(s), Total: 1 test(s)
    Name: Tests.Polymorph.Widgets Failed: 0 test(s), Passed: 9 test(s), Skipped: 0 test(s), Total: 9 test(s)
    Name: Tests.Release Failed: 1 test(s), Passed: 2 test(s), Skipped: 0 test(s), Total: 3 test(s)
  • Failed: Tests.Release.ReleaseTest.testUndeclared
  • Name: Tests.ScriptLoader Failed: 0 test(s), Passed: 4 test(s), Skipped: 0 test(s), Total: 4 test(s)
    Name: Tests.System Failed: 0 test(s), Passed: 298 test(s), Skipped: 0 test(s), Total: 298 test(s)
    Name: Tests.SystemChangeNotification Failed: 0 test(s), Passed: 37 test(s), Skipped: 0 test(s), Total: 37 test(s)
    Name: Tests.SystemHistory Failed: 0 test(s), Passed: 14 test(s), Skipped: 0 test(s), Total: 14 test(s)
    Name: Tests.SystemSupport Failed: 0 test(s), Passed: 9 test(s), Skipped: 0 test(s), Total: 9 test(s)
    Name: Tests.TextEditors Failed: 0 test(s), Passed: 7 test(s), Skipped: 0 test(s), Total: 7 test(s)
    Name: Tests.Traits Failed: 0 test(s), Passed: 60 test(s), Skipped: 0 test(s), Total: 60 test(s)
    Name: Tests.Traits.MOP Failed: 0 test(s), Passed: 3 test(s), Skipped: 0 test(s), Total: 3 test(s)
    Name: Tests.VM Failed: 0 test(s), Passed: 10 test(s), Skipped: 0 test(s), Total: 10 test(s)
    Name: ToolsTest.Debugger Failed: 0 test(s), Passed: 10 test(s), Skipped: 0 test(s), Total: 10 test(s)
    Name: ToolsTest.Inspector Failed: 0 test(s), Passed: 1 test(s), Skipped: 0 test(s), Total: 1 test(s)
    Name: ToolsTest.MessageTally Failed: 0 test(s), Passed: 5 test(s), Skipped: 0 test(s), Total: 5 test(s)
    Name: ToolsTest.PointerFinder Failed: 0 test(s), Passed: 3 test(s), Skipped: 0 test(s), Total: 3 test(s)
    Name: Zinc.Tests Failed: 0 test(s), Passed: 201 test(s), Skipped: 0 test(s), Total: 201 test(s)

    Reply | Threaded
    Open this post in threaded view
    |  
    Report Content as Inappropriate

    Pharo 1.3 - Build # 27 - Still Unstable!

    jenkins-pharo.ci.inria.fr
    BUILD UNSTABLE
    Build URLhttps://ci.lille.inria.fr/pharo/job/Pharo%201.3/27/
    Project:Pharo 1.3
    Date of build:Wed, 28 Mar 2012 14:48:36 +0200
    Build duration:21 min

    CHANGES
    No Changes

    BUILD ARTIFACTS
  • Pharo-1.3/Pharo-1.3.st
  • Pharo-1.3.changes
  • Pharo-1.3.image
  • Pharo-1.3.zip

  • JUnit Tests
    Name: AST.Tests.Core Failed: 0 test(s), Passed: 69 test(s), Skipped: 0 test(s), Total: 69 test(s)
    Name: AST.Tests.Semantic Failed: 0 test(s), Passed: 25 test(s), Skipped: 0 test(s), Total: 25 test(s)
    Name: Announcements.Tests.Core Failed: 0 test(s), Passed: 27 test(s), Skipped: 0 test(s), Total: 27 test(s)
    Name: AutomaticMethodCategorizer.Tests Failed: 0 test(s), Passed: 14 test(s), Skipped: 0 test(s), Total: 14 test(s)
    Name: AutomaticMethodCategorizerOB.Tests Failed: 0 test(s), Passed: 2 test(s), Skipped: 0 test(s), Total: 2 test(s)
    Name: Autotest.Tests.Core Failed: 0 test(s), Passed: 27 test(s), Skipped: 0 test(s), Total: 27 test(s)
    Name: Autotest.Tests.GUI Failed: 0 test(s), Passed: 1 test(s), Skipped: 0 test(s), Total: 1 test(s)
    Name: Balloon.Collections.Tests Failed: 0 test(s), Passed: 34 test(s), Skipped: 0 test(s), Total: 34 test(s)
    Name: CollectionsTests.Arrayed Failed: 0 test(s), Passed: 562 test(s), Skipped: 0 test(s), Total: 562 test(s)
    Name: CollectionsTests.Atomic Failed: 0 test(s), Passed: 12 test(s), Skipped: 0 test(s), Total: 12 test(s)
    Name: CollectionsTests.Sequenceable Failed: 0 test(s), Passed: 912 test(s), Skipped: 0 test(s), Total: 912 test(s)
    Name: CollectionsTests.SplitJoin Failed: 0 test(s), Passed: 27 test(s), Skipped: 0 test(s), Total: 27 test(s)
    Name: CollectionsTests.Stack Failed: 0 test(s), Passed: 16 test(s), Skipped: 0 test(s), Total: 16 test(s)
    Name: CollectionsTests.Streams Failed: 0 test(s), Passed: 25 test(s), Skipped: 0 test(s), Total: 25 test(s)
    Name: CollectionsTests.Strings Failed: 0 test(s), Passed: 590 test(s), Skipped: 0 test(s), Total: 590 test(s)
    Name: CollectionsTests.Support Failed: 0 test(s), Passed: 12 test(s), Skipped: 0 test(s), Total: 12 test(s)
    Name: CollectionsTests.Text Failed: 0 test(s), Passed: 40 test(s), Skipped: 0 test(s), Total: 40 test(s)
    Name: CollectionsTests.Unordered Failed: 0 test(s), Passed: 1977 test(s), Skipped: 0 test(s), Total: 1977 test(s)
    Name: CollectionsTests.Weak Failed: 0 test(s), Passed: 751 test(s), Skipped: 0 test(s), Total: 751 test(s)
    Name: CompilerTests Failed: 0 test(s), Passed: 30 test(s), Skipped: 0 test(s), Total: 30 test(s)
    Name: CompressionTests.Archive Failed: 0 test(s), Passed: 2 test(s), Skipped: 0 test(s), Total: 2 test(s)
    Name: Finder.Tests Failed: 0 test(s), Passed: 9 test(s), Skipped: 0 test(s), Total: 9 test(s)
    Name: FreeTypeTests.cache Failed: 0 test(s), Passed: 23 test(s), Skipped: 0 test(s), Total: 23 test(s)
    Name: Gofer.Tests Failed: 0 test(s), Passed: 45 test(s), Skipped: 0 test(s), Total: 45 test(s)
    Name: Graphics.Tests.Files Failed: 0 test(s), Passed: 47 test(s), Skipped: 0 test(s), Total: 47 test(s)
    Name: Graphics.Tests.Primitives Failed: 0 test(s), Passed: 57 test(s), Skipped: 0 test(s), Total: 57 test(s)
    Name: Graphics.Tests.Text Failed: 0 test(s), Passed: 2 test(s), Skipped: 0 test(s), Total: 2 test(s)
    Name: HelpSystem.Tests.Builders Failed: 0 test(s), Passed: 5 test(s), Skipped: 0 test(s), Total: 5 test(s)
    Name: HelpSystem.Tests.Core.Model Failed: 0 test(s), Passed: 4 test(s), Skipped: 0 test(s), Total: 4 test(s)
    Name: HelpSystem.Tests.Core.UI Failed: 0 test(s), Passed: 6 test(s), Skipped: 0 test(s), Total: 6 test(s)
    Name: HelpSystem.Tests.Core.Utilities Failed: 0 test(s), Passed: 2 test(s), Skipped: 0 test(s), Total: 2 test(s)
    Name: KernelTests.Chronology Failed: 0 test(s), Passed: 575 test(s), Skipped: 0 test(s), Total: 575 test(s)
    Name: KernelTests.Classes Failed: 0 test(s), Passed: 60 test(s), Skipped: 0 test(s), Total: 60 test(s)
    Name: KernelTests.Exception Failed: 0 test(s), Passed: 2 test(s), Skipped: 0 test(s), Total: 2 test(s)
    Name: KernelTests.Methods Failed: 0 test(s), Passed: 188 test(s), Skipped: 0 test(s), Total: 188 test(s)
    Name: KernelTests.Numbers Failed: 0 test(s), Passed: 220 test(s), Skipped: 0 test(s), Total: 220 test(s)
    Name: KernelTests.Objects Failed: 0 test(s), Passed: 84 test(s), Skipped: 0 test(s), Total: 84 test(s)
    Name: KernelTests.Pragmas Failed: 0 test(s), Passed: 3 test(s), Skipped: 0 test(s), Total: 3 test(s)
    Name: KernelTests.Processes Failed: 0 test(s), Passed: 22 test(s), Skipped: 0 test(s), Total: 22 test(s)
    Name: LED.Test Failed: 0 test(s), Passed: 2 test(s), Skipped: 0 test(s), Total: 2 test(s)
    Name: Metacello.TestsCore Failed: 0 test(s), Passed: 44 test(s), Skipped: 0 test(s), Total: 44 test(s)
    Name: Metacello.TestsMC Failed: 0 test(s), Passed: 303 test(s), Skipped: 0 test(s), Total: 303 test(s)
    Name: Metacello.TestsPlatform Failed: 0 test(s), Passed: 1 test(s), Skipped: 0 test(s), Total: 1 test(s)
    Name: Metacello.TestsProfStef Failed: 0 test(s), Passed: 1 test(s), Skipped: 0 test(s), Total: 1 test(s)
    Name: Metacello.TestsReference Failed: 0 test(s), Passed: 2 test(s), Skipped: 0 test(s), Total: 2 test(s)
    Name: Metacello.TestsTutorial Failed: 0 test(s), Passed: 32 test(s), Skipped: 0 test(s), Total: 32 test(s)
    Name: MethodWrappers.Tests Failed: 0 test(s), Passed: 2 test(s), Skipped: 0 test(s), Total: 2 test(s)
    Name: MorphicTests.Basic Failed: 0 test(s), Passed: 16 test(s), Skipped: 0 test(s), Total: 16 test(s)
    Name: MorphicTests.Kernel Failed: 0 test(s), Passed: 8 test(s), Skipped: 0 test(s), Total: 8 test(s)
    Name: MorphicTests.Text Support Failed: 0 test(s), Passed: 14 test(s), Skipped: 0 test(s), Total: 14 test(s)
    Name: MorphicTests.Widgets Failed: 0 test(s), Passed: 5 test(s), Skipped: 0 test(s), Total: 5 test(s)
    Name: MorphicTests.WindowNotification Failed: 0 test(s), Passed: 7 test(s), Skipped: 0 test(s), Total: 7 test(s)
    Name: Multilingual.Tests.TextConversion Failed: 0 test(s), Passed: 7 test(s), Skipped: 0 test(s), Total: 7 test(s)
    Name: NetworkTests.Kernel Failed: 0 test(s), Passed: 31 test(s), Skipped: 0 test(s), Total: 31 test(s)
    Name: NetworkTests.MailMessage Failed: 0 test(s), Passed: 2 test(s), Skipped: 0 test(s), Total: 2 test(s)
    Name: NetworkTests.Protocols Failed: 0 test(s), Passed: 3 test(s), Skipped: 0 test(s), Total: 3 test(s)
    Name: NetworkTests.RFC822 Failed: 0 test(s), Passed: 1 test(s), Skipped: 0 test(s), Total: 1 test(s)
    Name: NetworkTests.URI Failed: 0 test(s), Passed: 105 test(s), Skipped: 0 test(s), Total: 105 test(s)
    Name: NetworkTests.UUID Failed: 0 test(s), Passed: 11 test(s), Skipped: 0 test(s), Total: 11 test(s)
    Name: NetworkTests.Url Failed: 0 test(s), Passed: 42 test(s), Skipped: 0 test(s), Total: 42 test(s)
    Name: OB.Fake.Tests Failed: 0 test(s), Passed: 10 test(s), Skipped: 0 test(s), Total: 10 test(s)
    Name: OB.Tests.Core Failed: 0 test(s), Passed: 89 test(s), Skipped: 0 test(s), Total: 89 test(s)
    Name: OB.Tests.Morphic Failed: 0 test(s), Passed: 24 test(s), Skipped: 0 test(s), Total: 24 test(s)
    Name: OB.Tests.Standard Failed: 0 test(s), Passed: 647 test(s), Skipped: 0 test(s), Total: 647 test(s)
    Name: OcompletionTests Failed: 14 test(s), Passed: 64 test(s), Skipped: 0 test(s), Total: 78 test(s)
  • Failed: OcompletionTests.ECInstVarTypeGuesserTest.testComplexInit
  • Failed: OcompletionTests.ECInstVarTypeGuesserTest.testComplexInit2
  • Failed: OcompletionTests.ECInstVarTypeGuesserTest.testConstantArray
  • Failed: OcompletionTests.ECInstVarTypeGuesserTest.testConstantBoolean
  • Failed: OcompletionTests.ECInstVarTypeGuesserTest.testConstantInteger
  • Failed: OcompletionTests.ECInstVarTypeGuesserTest.testConstantIntegerNil
  • Failed: OcompletionTests.ECInstVarTypeGuesserTest.testConstantString
  • Failed: OcompletionTests.ECInstVarTypeGuesserTest.testConstantSymbol
  • Failed: OcompletionTests.ECInstVarTypeGuesserTest.testGlobalVarKeyword
  • Failed: OcompletionTests.ECInstVarTypeGuesserTest.testGlobalVarKeyword2
  • Failed: OcompletionTests.ECInstVarTypeGuesserTest.testMessageSend
  • Failed: OcompletionTests.ECInstVarTypeGuesserTest.testMessageSend2
  • Failed: OcompletionTests.ECInstVarTypeGuesserTest.testSuperWithAnotherInit
  • Failed: OcompletionTests.ECInstVarTypeGuesserTest.testTypeSuggestingParameter
  • Name: ProfStef.Tests Failed: 0 test(s), Passed: 47 test(s), Skipped: 0 test(s), Total: 47 test(s)
    Name: Refactoring.Tests.Changes Failed: 0 test(s), Passed: 43 test(s), Skipped: 0 test(s), Total: 43 test(s)
    Name: Refactoring.Tests.Core Failed: 0 test(s), Passed: 215 test(s), Skipped: 0 test(s), Total: 215 test(s)
    Name: Refactoring.Tests.Critics Failed: 0 test(s), Passed: 57 test(s), Skipped: 0 test(s), Total: 57 test(s)
    Name: Refactoring.Tests.Environment Failed: 0 test(s), Passed: 20 test(s), Skipped: 0 test(s), Total: 20 test(s)
    Name: Refactoring.Tests.Spelling Failed: 0 test(s), Passed: 16 test(s), Skipped: 0 test(s), Total: 16 test(s)
    Name: Regex.Tests.Core Failed: 0 test(s), Passed: 188 test(s), Skipped: 0 test(s), Total: 188 test(s)
    Name: RoelTyper.Tests Failed: 0 test(s), Passed: 72 test(s), Skipped: 0 test(s), Total: 72 test(s)
    Name: SUnit.Core.Extensions Failed: 0 test(s), Passed: 3 test(s), Skipped: 0 test(s), Total: 3 test(s)
    Name: SUnit.Core.Utilities Failed: 0 test(s), Passed: 3 test(s), Skipped: 0 test(s), Total: 3 test(s)
    Name: SUnit.Tests.Core Failed: 0 test(s), Passed: 77 test(s), Skipped: 0 test(s), Total: 77 test(s)
    Name: ShoutTests.Parsing Failed: 0 test(s), Passed: 5 test(s), Skipped: 0 test(s), Total: 5 test(s)
    Name: StratifiedProxy.Tests Failed: 0 test(s), Passed: 2 test(s), Skipped: 0 test(s), Total: 2 test(s)
    Name: Tests.Browser Failed: 0 test(s), Passed: 7 test(s), Skipped: 0 test(s), Total: 7 test(s)
    Name: Tests.Bugs Failed: 0 test(s), Passed: 60 test(s), Skipped: 0 test(s), Total: 60 test(s)
    Name: Tests.Compiler Failed: 0 test(s), Passed: 71 test(s), Skipped: 0 test(s), Total: 71 test(s)
    Name: Tests.Compression Failed: 0 test(s), Passed: 9 test(s), Skipped: 0 test(s), Total: 9 test(s)
    Name: Tests.Digital Signatures Failed: 0 test(s), Passed: 8 test(s), Skipped: 0 test(s), Total: 8 test(s)
    Name: Tests.Exceptions Failed: 0 test(s), Passed: 28 test(s), Skipped: 0 test(s), Total: 28 test(s)
    Name: Tests.Files Failed: 0 test(s), Passed: 54 test(s), Skipped: 0 test(s), Total: 54 test(s)
    Name: Tests.Finalization Failed: 0 test(s), Passed: 1 test(s), Skipped: 0 test(s), Total: 1 test(s)
    Name: Tests.Localization Failed: 0 test(s), Passed: 1 test(s), Skipped: 0 test(s), Total: 1 test(s)
    Name: Tests.Monticello Failed: 0 test(s), Passed: 120 test(s), Skipped: 0 test(s), Total: 120 test(s)
    Name: Tests.Multilingual Failed: 0 test(s), Passed: 3 test(s), Skipped: 0 test(s), Total: 3 test(s)
    Name: Tests.Object Events Failed: 0 test(s), Passed: 24 test(s), Skipped: 0 test(s), Total: 24 test(s)
    Name: Tests.ObjectsAsMethods Failed: 0 test(s), Passed: 3 test(s), Skipped: 0 test(s), Total: 3 test(s)
    Name: Tests.PackageInfo Failed: 0 test(s), Passed: 1 test(s), Skipped: 0 test(s), Total: 1 test(s)
    Name: Tests.Polymorph.Widgets Failed: 0 test(s), Passed: 9 test(s), Skipped: 0 test(s), Total: 9 test(s)
    Name: Tests.Release Failed: 1 test(s), Passed: 2 test(s), Skipped: 0 test(s), Total: 3 test(s)
  • Failed: Tests.Release.ReleaseTest.testUndeclared
  • Name: Tests.ScriptLoader Failed: 0 test(s), Passed: 4 test(s), Skipped: 0 test(s), Total: 4 test(s)
    Name: Tests.System Failed: 0 test(s), Passed: 298 test(s), Skipped: 0 test(s), Total: 298 test(s)
    Name: Tests.SystemChangeNotification Failed: 0 test(s), Passed: 37 test(s), Skipped: 0 test(s), Total: 37 test(s)
    Name: Tests.SystemHistory Failed: 0 test(s), Passed: 14 test(s), Skipped: 0 test(s), Total: 14 test(s)
    Name: Tests.SystemSupport Failed: 0 test(s), Passed: 9 test(s), Skipped: 0 test(s), Total: 9 test(s)
    Name: Tests.TextEditors Failed: 0 test(s), Passed: 7 test(s), Skipped: 0 test(s), Total: 7 test(s)
    Name: Tests.Traits Failed: 0 test(s), Passed: 60 test(s), Skipped: 0 test(s), Total: 60 test(s)
    Name: Tests.Traits.MOP Failed: 0 test(s), Passed: 3 test(s), Skipped: 0 test(s), Total: 3 test(s)
    Name: Tests.VM Failed: 0 test(s), Passed: 10 test(s), Skipped: 0 test(s), Total: 10 test(s)
    Name: ToolsTest.Debugger Failed: 0 test(s), Passed: 10 test(s), Skipped: 0 test(s), Total: 10 test(s)
    Name: ToolsTest.Inspector Failed: 0 test(s), Passed: 1 test(s), Skipped: 0 test(s), Total: 1 test(s)
    Name: ToolsTest.MessageTally Failed: 0 test(s), Passed: 5 test(s), Skipped: 0 test(s), Total: 5 test(s)
    Name: ToolsTest.PointerFinder Failed: 0 test(s), Passed: 3 test(s), Skipped: 0 test(s), Total: 3 test(s)
    Name: Zinc.Tests Failed: 0 test(s), Passed: 201 test(s), Skipped: 0 test(s), Total: 201 test(s)

    Reply | Threaded
    Open this post in threaded view
    |  
    Report Content as Inappropriate

    Pharo 1.3 - Build # 28 - Still Unstable!

    jenkins-pharo.ci.inria.fr
    BUILD UNSTABLE
    Build URLhttps://ci.lille.inria.fr/pharo/job/Pharo%201.3/28/
    Project:Pharo 1.3
    Date of build:Thu, 05 Apr 2012 19:39:32 +0200
    Build duration:19 min

    CHANGES
    No Changes

    BUILD ARTIFACTS
  • Pharo-1.3/Pharo-1.3.st
  • Pharo-1.3.changes
  • Pharo-1.3.image
  • Pharo-1.3.zip

  • JUnit Tests
    Name: AST.Tests.Core Failed: 0 test(s), Passed: 69 test(s), Skipped: 0 test(s), Total: 69 test(s)
    Name: AST.Tests.Semantic Failed: 0 test(s), Passed: 25 test(s), Skipped: 0 test(s), Total: 25 test(s)
    Name: Announcements.Tests.Core Failed: 0 test(s), Passed: 27 test(s), Skipped: 0 test(s), Total: 27 test(s)
    Name: AutomaticMethodCategorizer.Tests Failed: 0 test(s), Passed: 14 test(s), Skipped: 0 test(s), Total: 14 test(s)
    Name: AutomaticMethodCategorizerOB.Tests Failed: 0 test(s), Passed: 2 test(s), Skipped: 0 test(s), Total: 2 test(s)
    Name: Autotest.Tests.Core Failed: 0 test(s), Passed: 27 test(s), Skipped: 0 test(s), Total: 27 test(s)
    Name: Autotest.Tests.GUI Failed: 0 test(s), Passed: 1 test(s), Skipped: 0 test(s), Total: 1 test(s)
    Name: Balloon.Collections.Tests Failed: 0 test(s), Passed: 34 test(s), Skipped: 0 test(s), Total: 34 test(s)
    Name: CollectionsTests.Arrayed Failed: 0 test(s), Passed: 562 test(s), Skipped: 0 test(s), Total: 562 test(s)
    Name: CollectionsTests.Atomic Failed: 0 test(s), Passed: 12 test(s), Skipped: 0 test(s), Total: 12 test(s)
    Name: CollectionsTests.Sequenceable Failed: 0 test(s), Passed: 912 test(s), Skipped: 0 test(s), Total: 912 test(s)
    Name: CollectionsTests.SplitJoin Failed: 0 test(s), Passed: 27 test(s), Skipped: 0 test(s), Total: 27 test(s)
    Name: CollectionsTests.Stack Failed: 0 test(s), Passed: 16 test(s), Skipped: 0 test(s), Total: 16 test(s)
    Name: CollectionsTests.Streams Failed: 0 test(s), Passed: 25 test(s), Skipped: 0 test(s), Total: 25 test(s)
    Name: CollectionsTests.Strings Failed: 0 test(s), Passed: 590 test(s), Skipped: 0 test(s), Total: 590 test(s)
    Name: CollectionsTests.Support Failed: 0 test(s), Passed: 12 test(s), Skipped: 0 test(s), Total: 12 test(s)
    Name: CollectionsTests.Text Failed: 0 test(s), Passed: 40 test(s), Skipped: 0 test(s), Total: 40 test(s)
    Name: CollectionsTests.Unordered Failed: 0 test(s), Passed: 1977 test(s), Skipped: 0 test(s), Total: 1977 test(s)
    Name: CollectionsTests.Weak Failed: 0 test(s), Passed: 751 test(s), Skipped: 0 test(s), Total: 751 test(s)
    Name: CompilerTests Failed: 0 test(s), Passed: 30 test(s), Skipped: 0 test(s), Total: 30 test(s)
    Name: CompressionTests.Archive Failed: 0 test(s), Passed: 2 test(s), Skipped: 0 test(s), Total: 2 test(s)
    Name: Finder.Tests Failed: 0 test(s), Passed: 9 test(s), Skipped: 0 test(s), Total: 9 test(s)
    Name: FreeTypeTests.cache Failed: 0 test(s), Passed: 23 test(s), Skipped: 0 test(s), Total: 23 test(s)
    Name: Gofer.Tests Failed: 0 test(s), Passed: 45 test(s), Skipped: 0 test(s), Total: 45 test(s)
    Name: Graphics.Tests.Files Failed: 0 test(s), Passed: 47 test(s), Skipped: 0 test(s), Total: 47 test(s)
    Name: Graphics.Tests.Primitives Failed: 0 test(s), Passed: 57 test(s), Skipped: 0 test(s), Total: 57 test(s)
    Name: Graphics.Tests.Text Failed: 0 test(s), Passed: 2 test(s), Skipped: 0 test(s), Total: 2 test(s)
    Name: HelpSystem.Tests.Builders Failed: 0 test(s), Passed: 5 test(s), Skipped: 0 test(s), Total: 5 test(s)
    Name: HelpSystem.Tests.Core.Model Failed: 0 test(s), Passed: 4 test(s), Skipped: 0 test(s), Total: 4 test(s)
    Name: HelpSystem.Tests.Core.UI Failed: 0 test(s), Passed: 6 test(s), Skipped: 0 test(s), Total: 6 test(s)
    Name: HelpSystem.Tests.Core.Utilities Failed: 0 test(s), Passed: 2 test(s), Skipped: 0 test(s), Total: 2 test(s)
    Name: KernelTests.Chronology Failed: 0 test(s), Passed: 575 test(s), Skipped: 0 test(s), Total: 575 test(s)
    Name: KernelTests.Classes Failed: 0 test(s), Passed: 60 test(s), Skipped: 0 test(s), Total: 60 test(s)
    Name: KernelTests.Exception Failed: 0 test(s), Passed: 2 test(s), Skipped: 0 test(s), Total: 2 test(s)
    Name: KernelTests.Methods Failed: 0 test(s), Passed: 188 test(s), Skipped: 0 test(s), Total: 188 test(s)
    Name: KernelTests.Numbers Failed: 0 test(s), Passed: 220 test(s), Skipped: 0 test(s), Total: 220 test(s)
    Name: KernelTests.Objects Failed: 0 test(s), Passed: 84 test(s), Skipped: 0 test(s), Total: 84 test(s)
    Name: KernelTests.Pragmas Failed: 0 test(s), Passed: 3 test(s), Skipped: 0 test(s), Total: 3 test(s)
    Name: KernelTests.Processes Failed: 0 test(s), Passed: 22 test(s), Skipped: 0 test(s), Total: 22 test(s)
    Name: LED.Test Failed: 0 test(s), Passed: 2 test(s), Skipped: 0 test(s), Total: 2 test(s)
    Name: Metacello.TestsCore Failed: 0 test(s), Passed: 44 test(s), Skipped: 0 test(s), Total: 44 test(s)
    Name: Metacello.TestsMC Failed: 0 test(s), Passed: 303 test(s), Skipped: 0 test(s), Total: 303 test(s)
    Name: Metacello.TestsPlatform Failed: 0 test(s), Passed: 1 test(s), Skipped: 0 test(s), Total: 1 test(s)
    Name: Metacello.TestsProfStef Failed: 0 test(s), Passed: 1 test(s), Skipped: 0 test(s), Total: 1 test(s)
    Name: Metacello.TestsReference Failed: 0 test(s), Passed: 2 test(s), Skipped: 0 test(s), Total: 2 test(s)
    Name: Metacello.TestsTutorial Failed: 0 test(s), Passed: 32 test(s), Skipped: 0 test(s), Total: 32 test(s)
    Name: MethodWrappers.Tests Failed: 0 test(s), Passed: 2 test(s), Skipped: 0 test(s), Total: 2 test(s)
    Name: MorphicTests.Basic Failed: 0 test(s), Passed: 16 test(s), Skipped: 0 test(s), Total: 16 test(s)
    Name: MorphicTests.Kernel Failed: 0 test(s), Passed: 8 test(s), Skipped: 0 test(s), Total: 8 test(s)
    Name: MorphicTests.Text Support Failed: 0 test(s), Passed: 14 test(s), Skipped: 0 test(s), Total: 14 test(s)
    Name: MorphicTests.Widgets Failed: 0 test(s), Passed: 5 test(s), Skipped: 0 test(s), Total: 5 test(s)
    Name: MorphicTests.WindowNotification Failed: 0 test(s), Passed: 7 test(s), Skipped: 0 test(s), Total: 7 test(s)
    Name: Multilingual.Tests.TextConversion Failed: 0 test(s), Passed: 7 test(s), Skipped: 0 test(s), Total: 7 test(s)
    Name: NetworkTests.Kernel Failed: 0 test(s), Passed: 31 test(s), Skipped: 0 test(s), Total: 31 test(s)
    Name: NetworkTests.MailMessage Failed: 0 test(s), Passed: 2 test(s), Skipped: 0 test(s), Total: 2 test(s)
    Name: NetworkTests.Protocols Failed: 0 test(s), Passed: 3 test(s), Skipped: 0 test(s), Total: 3 test(s)
    Name: NetworkTests.RFC822 Failed: 0 test(s), Passed: 1 test(s), Skipped: 0 test(s), Total: 1 test(s)
    Name: NetworkTests.URI Failed: 0 test(s), Passed: 105 test(s), Skipped: 0 test(s), Total: 105 test(s)
    Name: NetworkTests.UUID Failed: 0 test(s), Passed: 11 test(s), Skipped: 0 test(s), Total: 11 test(s)
    Name: NetworkTests.Url Failed: 0 test(s), Passed: 42 test(s), Skipped: 0 test(s), Total: 42 test(s)
    Name: OB.Fake.Tests Failed: 0 test(s), Passed: 10 test(s), Skipped: 0 test(s), Total: 10 test(s)
    Name: OB.Tests.Core Failed: 0 test(s), Passed: 89 test(s), Skipped: 0 test(s), Total: 89 test(s)
    Name: OB.Tests.Morphic Failed: 0 test(s), Passed: 24 test(s), Skipped: 0 test(s), Total: 24 test(s)
    Name: OB.Tests.Standard Failed: 0 test(s), Passed: 647 test(s), Skipped: 0 test(s), Total: 647 test(s)
    Name: OcompletionTests Failed: 14 test(s), Passed: 64 test(s), Skipped: 0 test(s), Total: 78 test(s)
  • Failed: OcompletionTests.ECInstVarTypeGuesserTest.testComplexInit
  • Failed: OcompletionTests.ECInstVarTypeGuesserTest.testComplexInit2
  • Failed: OcompletionTests.ECInstVarTypeGuesserTest.testConstantArray
  • Failed: OcompletionTests.ECInstVarTypeGuesserTest.testConstantBoolean
  • Failed: OcompletionTests.ECInstVarTypeGuesserTest.testConstantInteger
  • Failed: OcompletionTests.ECInstVarTypeGuesserTest.testConstantIntegerNil
  • Failed: OcompletionTests.ECInstVarTypeGuesserTest.testConstantString
  • Failed: OcompletionTests.ECInstVarTypeGuesserTest.testConstantSymbol
  • Failed: OcompletionTests.ECInstVarTypeGuesserTest.testGlobalVarKeyword
  • Failed: OcompletionTests.ECInstVarTypeGuesserTest.testGlobalVarKeyword2
  • Failed: OcompletionTests.ECInstVarTypeGuesserTest.testMessageSend
  • Failed: OcompletionTests.ECInstVarTypeGuesserTest.testMessageSend2
  • Failed: OcompletionTests.ECInstVarTypeGuesserTest.testSuperWithAnotherInit
  • Failed: OcompletionTests.ECInstVarTypeGuesserTest.testTypeSuggestingParameter
  • Name: ProfStef.Tests Failed: 0 test(s), Passed: 47 test(s), Skipped: 0 test(s), Total: 47 test(s)
    Name: Refactoring.Tests.Changes Failed: 0 test(s), Passed: 43 test(s), Skipped: 0 test(s), Total: 43 test(s)
    Name: Refactoring.Tests.Core Failed: 0 test(s), Passed: 215 test(s), Skipped: 0 test(s), Total: 215 test(s)
    Name: Refactoring.Tests.Critics Failed: 0 test(s), Passed: 57 test(s), Skipped: 0 test(s), Total: 57 test(s)
    Name: Refactoring.Tests.Environment Failed: 0 test(s), Passed: 20 test(s), Skipped: 0 test(s), Total: 20 test(s)
    Name: Refactoring.Tests.Spelling Failed: 0 test(s), Passed: 16 test(s), Skipped: 0 test(s), Total: 16 test(s)
    Name: Regex.Tests.Core Failed: 0 test(s), Passed: 188 test(s), Skipped: 0 test(s), Total: 188 test(s)
    Name: RoelTyper.Tests Failed: 0 test(s), Passed: 72 test(s), Skipped: 0 test(s), Total: 72 test(s)
    Name: SUnit.Core.Extensions Failed: 0 test(s), Passed: 3 test(s), Skipped: 0 test(s), Total: 3 test(s)
    Name: SUnit.Core.Utilities Failed: 0 test(s), Passed: 3 test(s), Skipped: 0 test(s), Total: 3 test(s)
    Name: SUnit.Tests.Core Failed: 0 test(s), Passed: 77 test(s), Skipped: 0 test(s), Total: 77 test(s)
    Name: ShoutTests.Parsing Failed: 0 test(s), Passed: 5 test(s), Skipped: 0 test(s), Total: 5 test(s)
    Name: StratifiedProxy.Tests Failed: 0 test(s), Passed: 2 test(s), Skipped: 0 test(s), Total: 2 test(s)
    Name: Tests.Browser Failed: 0 test(s), Passed: 7 test(s), Skipped: 0 test(s), Total: 7 test(s)
    Name: Tests.Bugs Failed: 0 test(s), Passed: 60 test(s), Skipped: 0 test(s), Total: 60 test(s)
    Name: Tests.Compiler Failed: 0 test(s), Passed: 71 test(s), Skipped: 0 test(s), Total: 71 test(s)
    Name: Tests.Compression Failed: 0 test(s), Passed: 9 test(s), Skipped: 0 test(s), Total: 9 test(s)
    Name: Tests.Digital Signatures Failed: 0 test(s), Passed: 8 test(s), Skipped: 0 test(s), Total: 8 test(s)
    Name: Tests.Exceptions Failed: 0 test(s), Passed: 28 test(s), Skipped: 0 test(s), Total: 28 test(s)
    Name: Tests.Files Failed: 0 test(s), Passed: 54 test(s), Skipped: 0 test(s), Total: 54 test(s)
    Name: Tests.Finalization Failed: 0 test(s), Passed: 1 test(s), Skipped: 0 test(s), Total: 1 test(s)
    Name: Tests.Localization Failed: 0 test(s), Passed: 1 test(s), Skipped: 0 test(s), Total: 1 test(s)
    Name: Tests.Monticello Failed: 0 test(s), Passed: 120 test(s), Skipped: 0 test(s), Total: 120 test(s)
    Name: Tests.Multilingual Failed: 0 test(s), Passed: 3 test(s), Skipped: 0 test(s), Total: 3 test(s)
    Name: Tests.Object Events Failed: 0 test(s), Passed: 24 test(s), Skipped: 0 test(s), Total: 24 test(s)
    Name: Tests.ObjectsAsMethods Failed: 0 test(s), Passed: 3 test(s), Skipped: 0 test(s), Total: 3 test(s)
    Name: Tests.PackageInfo Failed: 0 test(s), Passed: 1 test(s), Skipped: 0 test(s), Total: 1 test(s)
    Name: Tests.Polymorph.Widgets Failed: 0 test(s), Passed: 9 test(s), Skipped: 0 test(s), Total: 9 test(s)
    Name: Tests.Release Failed: 1 test(s), Passed: 2 test(s), Skipped: 0 test(s), Total: 3 test(s)
  • Failed: Tests.Release.ReleaseTest.testUndeclared
  • Name: Tests.ScriptLoader Failed: 0 test(s), Passed: 4 test(s), Skipped: 0 test(s), Total: 4 test(s)
    Name: Tests.System Failed: 0 test(s), Passed: 298 test(s), Skipped: 0 test(s), Total: 298 test(s)
    Name: Tests.SystemChangeNotification Failed: 0 test(s), Passed: 37 test(s), Skipped: 0 test(s), Total: 37 test(s)
    Name: Tests.SystemHistory Failed: 0 test(s), Passed: 14 test(s), Skipped: 0 test(s), Total: 14 test(s)
    Name: Tests.SystemSupport Failed: 0 test(s), Passed: 9 test(s), Skipped: 0 test(s), Total: 9 test(s)
    Name: Tests.TextEditors Failed: 0 test(s), Passed: 7 test(s), Skipped: 0 test(s), Total: 7 test(s)
    Name: Tests.Traits Failed: 0 test(s), Passed: 60 test(s), Skipped: 0 test(s), Total: 60 test(s)
    Name: Tests.Traits.MOP Failed: 0 test(s), Passed: 3 test(s), Skipped: 0 test(s), Total: 3 test(s)
    Name: Tests.VM Failed: 0 test(s), Passed: 10 test(s), Skipped: 0 test(s), Total: 10 test(s)
    Name: ToolsTest.Debugger Failed: 0 test(s), Passed: 10 test(s), Skipped: 0 test(s), Total: 10 test(s)
    Name: ToolsTest.Inspector Failed: 0 test(s), Passed: 1 test(s), Skipped: 0 test(s), Total: 1 test(s)
    Name: ToolsTest.MessageTally Failed: 0 test(s), Passed: 5 test(s), Skipped: 0 test(s), Total: 5 test(s)
    Name: ToolsTest.PointerFinder Failed: 0 test(s), Passed: 3 test(s), Skipped: 0 test(s), Total: 3 test(s)
    Name: Zinc.Tests Failed: 0 test(s), Passed: 206 test(s), Skipped: 0 test(s), Total: 206 test(s)

    Reply | Threaded
    Open this post in threaded view
    |  
    Report Content as Inappropriate

    Pharo 1.3 - Build # 29 - Still Unstable!

    jenkins-pharo.ci.inria.fr
    BUILD UNSTABLE
    Build URLhttps://ci.lille.inria.fr/pharo/job/Pharo%201.3/29/
    Project:Pharo 1.3
    Date of build:Thu, 12 Apr 2012 14:49:40 +0200
    Build duration:21 min

    CHANGES
    No Changes

    BUILD ARTIFACTS
  • Pharo-1.3/Pharo-1.3.st
  • Pharo-1.3.changes
  • Pharo-1.3.image
  • Pharo-1.3.zip

  • JUnit Tests
    Name: AST.Tests.Core Failed: 0 test(s), Passed: 69 test(s), Skipped: 0 test(s), Total: 69 test(s)
    Name: AST.Tests.Semantic Failed: 0 test(s), Passed: 25 test(s), Skipped: 0 test(s), Total: 25 test(s)
    Name: Announcements.Tests.Core Failed: 0 test(s), Passed: 27 test(s), Skipped: 0 test(s), Total: 27 test(s)
    Name: AutomaticMethodCategorizer.Tests Failed: 0 test(s), Passed: 14 test(s), Skipped: 0 test(s), Total: 14 test(s)
    Name: AutomaticMethodCategorizerOB.Tests Failed: 0 test(s), Passed: 2 test(s), Skipped: 0 test(s), Total: 2 test(s)
    Name: Autotest.Tests.Core Failed: 0 test(s), Passed: 27 test(s), Skipped: 0 test(s), Total: 27 test(s)
    Name: Autotest.Tests.GUI Failed: 0 test(s), Passed: 1 test(s), Skipped: 0 test(s), Total: 1 test(s)
    Name: Balloon.Collections.Tests Failed: 0 test(s), Passed: 34 test(s), Skipped: 0 test(s), Total: 34 test(s)
    Name: CollectionsTests.Arrayed Failed: 0 test(s), Passed: 562 test(s), Skipped: 0 test(s), Total: 562 test(s)
    Name: CollectionsTests.Atomic Failed: 0 test(s), Passed: 12 test(s), Skipped: 0 test(s), Total: 12 test(s)
    Name: CollectionsTests.Sequenceable Failed: 0 test(s), Passed: 912 test(s), Skipped: 0 test(s), Total: 912 test(s)
    Name: CollectionsTests.SplitJoin Failed: 0 test(s), Passed: 27 test(s), Skipped: 0 test(s), Total: 27 test(s)
    Name: CollectionsTests.Stack Failed: 0 test(s), Passed: 16 test(s), Skipped: 0 test(s), Total: 16 test(s)
    Name: CollectionsTests.Streams Failed: 0 test(s), Passed: 25 test(s), Skipped: 0 test(s), Total: 25 test(s)
    Name: CollectionsTests.Strings Failed: 0 test(s), Passed: 590 test(s), Skipped: 0 test(s), Total: 590 test(s)
    Name: CollectionsTests.Support Failed: 0 test(s), Passed: 12 test(s), Skipped: 0 test(s), Total: 12 test(s)
    Name: CollectionsTests.Text Failed: 0 test(s), Passed: 40 test(s), Skipped: 0 test(s), Total: 40 test(s)
    Name: CollectionsTests.Unordered Failed: 0 test(s), Passed: 1977 test(s), Skipped: 0 test(s), Total: 1977 test(s)
    Name: CollectionsTests.Weak Failed: 0 test(s), Passed: 751 test(s), Skipped: 0 test(s), Total: 751 test(s)
    Name: CompilerTests Failed: 0 test(s), Passed: 30 test(s), Skipped: 0 test(s), Total: 30 test(s)
    Name: CompressionTests.Archive Failed: 0 test(s), Passed: 2 test(s), Skipped: 0 test(s), Total: 2 test(s)
    Name: Finder.Tests Failed: 0 test(s), Passed: 9 test(s), Skipped: 0 test(s), Total: 9 test(s)
    Name: FreeTypeTests.cache Failed: 0 test(s), Passed: 23 test(s), Skipped: 0 test(s), Total: 23 test(s)
    Name: Gofer.Tests Failed: 0 test(s), Passed: 45 test(s), Skipped: 0 test(s), Total: 45 test(s)
    Name: Graphics.Tests.Files Failed: 0 test(s), Passed: 47 test(s), Skipped: 0 test(s), Total: 47 test(s)
    Name: Graphics.Tests.Primitives Failed: 0 test(s), Passed: 57 test(s), Skipped: 0 test(s), Total: 57 test(s)
    Name: Graphics.Tests.Text Failed: 0 test(s), Passed: 2 test(s), Skipped: 0 test(s), Total: 2 test(s)
    Name: HelpSystem.Tests.Builders Failed: 0 test(s), Passed: 5 test(s), Skipped: 0 test(s), Total: 5 test(s)
    Name: HelpSystem.Tests.Core.Model Failed: 0 test(s), Passed: 4 test(s), Skipped: 0 test(s), Total: 4 test(s)
    Name: HelpSystem.Tests.Core.UI Failed: 0 test(s), Passed: 6 test(s), Skipped: 0 test(s), Total: 6 test(s)
    Name: HelpSystem.Tests.Core.Utilities Failed: 0 test(s), Passed: 2 test(s), Skipped: 0 test(s), Total: 2 test(s)
    Name: KernelTests.Chronology Failed: 0 test(s), Passed: 575 test(s), Skipped: 0 test(s), Total: 575 test(s)
    Name: KernelTests.Classes Failed: 0 test(s), Passed: 60 test(s), Skipped: 0 test(s), Total: 60 test(s)
    Name: KernelTests.Exception Failed: 0 test(s), Passed: 2 test(s), Skipped: 0 test(s), Total: 2 test(s)
    Name: KernelTests.Methods Failed: 0 test(s), Passed: 188 test(s), Skipped: 0 test(s), Total: 188 test(s)
    Name: KernelTests.Numbers Failed: 0 test(s), Passed: 220 test(s), Skipped: 0 test(s), Total: 220 test(s)
    Name: KernelTests.Objects Failed: 0 test(s), Passed: 84 test(s), Skipped: 0 test(s), Total: 84 test(s)
    Name: KernelTests.Pragmas Failed: 0 test(s), Passed: 3 test(s), Skipped: 0 test(s), Total: 3 test(s)
    Name: KernelTests.Processes Failed: 0 test(s), Passed: 22 test(s), Skipped: 0 test(s), Total: 22 test(s)
    Name: LED.Test Failed: 0 test(s), Passed: 2 test(s), Skipped: 0 test(s), Total: 2 test(s)
    Name: Metacello.TestsCore Failed: 0 test(s), Passed: 44 test(s), Skipped: 0 test(s), Total: 44 test(s)
    Name: Metacello.TestsMC Failed: 0 test(s), Passed: 303 test(s), Skipped: 0 test(s), Total: 303 test(s)
    Name: Metacello.TestsPlatform Failed: 0 test(s), Passed: 1 test(s), Skipped: 0 test(s), Total: 1 test(s)
    Name: Metacello.TestsProfStef Failed: 0 test(s), Passed: 1 test(s), Skipped: 0 test(s), Total: 1 test(s)
    Name: Metacello.TestsReference Failed: 0 test(s), Passed: 2 test(s), Skipped: 0 test(s), Total: 2 test(s)
    Name: Metacello.TestsTutorial Failed: 0 test(s), Passed: 32 test(s), Skipped: 0 test(s), Total: 32 test(s)
    Name: MethodWrappers.Tests Failed: 0 test(s), Passed: 2 test(s), Skipped: 0 test(s), Total: 2 test(s)
    Name: MorphicTests.Basic Failed: 0 test(s), Passed: 16 test(s), Skipped: 0 test(s), Total: 16 test(s)
    Name: MorphicTests.Kernel Failed: 0 test(s), Passed: 8 test(s), Skipped: 0 test(s), Total: 8 test(s)
    Name: MorphicTests.Text Support Failed: 0 test(s), Passed: 14 test(s), Skipped: 0 test(s), Total: 14 test(s)
    Name: MorphicTests.Widgets Failed: 0 test(s), Passed: 5 test(s), Skipped: 0 test(s), Total: 5 test(s)
    Name: MorphicTests.WindowNotification Failed: 0 test(s), Passed: 7 test(s), Skipped: 0 test(s), Total: 7 test(s)
    Name: Multilingual.Tests.TextConversion Failed: 0 test(s), Passed: 7 test(s), Skipped: 0 test(s), Total: 7 test(s)
    Name: NetworkTests.Kernel Failed: 0 test(s), Passed: 31 test(s), Skipped: 0 test(s), Total: 31 test(s)
    Name: NetworkTests.MailMessage Failed: 0 test(s), Passed: 2 test(s), Skipped: 0 test(s), Total: 2 test(s)
    Name: NetworkTests.Protocols Failed: 0 test(s), Passed: 3 test(s), Skipped: 0 test(s), Total: 3 test(s)
    Name: NetworkTests.RFC822 Failed: 0 test(s), Passed: 1 test(s), Skipped: 0 test(s), Total: 1 test(s)
    Name: NetworkTests.URI Failed: 0 test(s), Passed: 105 test(s), Skipped: 0 test(s), Total: 105 test(s)
    Name: NetworkTests.UUID Failed: 0 test(s), Passed: 11 test(s), Skipped: 0 test(s), Total: 11 test(s)
    Name: NetworkTests.Url Failed: 0 test(s), Passed: 42 test(s), Skipped: 0 test(s), Total: 42 test(s)
    Name: OB.Fake.Tests Failed: 0 test(s), Passed: 10 test(s), Skipped: 0 test(s), Total: 10 test(s)
    Name: OB.Tests.Core Failed: 0 test(s), Passed: 89 test(s), Skipped: 0 test(s), Total: 89 test(s)
    Name: OB.Tests.Morphic Failed: 0 test(s), Passed: 24 test(s), Skipped: 0 test(s), Total: 24 test(s)
    Name: OB.Tests.Standard Failed: 0 test(s), Passed: 647 test(s), Skipped: 0 test(s), Total: 647 test(s)
    Name: OcompletionTests Failed: 14 test(s), Passed: 64 test(s), Skipped: 0 test(s), Total: 78 test(s)
  • Failed: OcompletionTests.ECInstVarTypeGuesserTest.testComplexInit
  • Failed: OcompletionTests.ECInstVarTypeGuesserTest.testComplexInit2
  • Failed: OcompletionTests.ECInstVarTypeGuesserTest.testConstantArray
  • Failed: OcompletionTests.ECInstVarTypeGuesserTest.testConstantBoolean
  • Failed: OcompletionTests.ECInstVarTypeGuesserTest.testConstantInteger
  • Failed: OcompletionTests.ECInstVarTypeGuesserTest.testConstantIntegerNil
  • Failed: OcompletionTests.ECInstVarTypeGuesserTest.testConstantString
  • Failed: OcompletionTests.ECInstVarTypeGuesserTest.testConstantSymbol
  • Failed: OcompletionTests.ECInstVarTypeGuesserTest.testGlobalVarKeyword
  • Failed: OcompletionTests.ECInstVarTypeGuesserTest.testGlobalVarKeyword2
  • Failed: OcompletionTests.ECInstVarTypeGuesserTest.testMessageSend
  • Failed: OcompletionTests.ECInstVarTypeGuesserTest.testMessageSend2
  • Failed: OcompletionTests.ECInstVarTypeGuesserTest.testSuperWithAnotherInit
  • Failed: OcompletionTests.ECInstVarTypeGuesserTest.testTypeSuggestingParameter
  • Name: ProfStef.Tests Failed: 0 test(s), Passed: 47 test(s), Skipped: 0 test(s), Total: 47 test(s)
    Name: Refactoring.Tests.Changes Failed: 0 test(s), Passed: 43 test(s), Skipped: 0 test(s), Total: 43 test(s)
    Name: Refactoring.Tests.Core Failed: 0 test(s), Passed: 215 test(s), Skipped: 0 test(s), Total: 215 test(s)
    Name: Refactoring.Tests.Critics Failed: 0 test(s), Passed: 57 test(s), Skipped: 0 test(s), Total: 57 test(s)
    Name: Refactoring.Tests.Environment Failed: 0 test(s), Passed: 20 test(s), Skipped: 0 test(s), Total: 20 test(s)
    Name: Refactoring.Tests.Spelling Failed: 0 test(s), Passed: 16 test(s), Skipped: 0 test(s), Total: 16 test(s)
    Name: Regex.Tests.Core Failed: 0 test(s), Passed: 188 test(s), Skipped: 0 test(s), Total: 188 test(s)
    Name: RoelTyper.Tests Failed: 0 test(s), Passed: 72 test(s), Skipped: 0 test(s), Total: 72 test(s)
    Name: SUnit.Core.Extensions Failed: 0 test(s), Passed: 3 test(s), Skipped: 0 test(s), Total: 3 test(s)
    Name: SUnit.Core.Utilities Failed: 0 test(s), Passed: 3 test(s), Skipped: 0 test(s), Total: 3 test(s)
    Name: SUnit.Tests.Core Failed: 0 test(s), Passed: 77 test(s), Skipped: 0 test(s), Total: 77 test(s)
    Name: ShoutTests.Parsing Failed: 0 test(s), Passed: 5 test(s), Skipped: 0 test(s), Total: 5 test(s)
    Name: StratifiedProxy.Tests Failed: 0 test(s), Passed: 2 test(s), Skipped: 0 test(s), Total: 2 test(s)
    Name: Tests.Browser Failed: 0 test(s), Passed: 7 test(s), Skipped: 0 test(s), Total: 7 test(s)
    Name: Tests.Bugs Failed: 0 test(s), Passed: 60 test(s), Skipped: 0 test(s), Total: 60 test(s)
    Name: Tests.Compiler Failed: 0 test(s), Passed: 71 test(s), Skipped: 0 test(s), Total: 71 test(s)
    Name: Tests.Compression Failed: 0 test(s), Passed: 9 test(s), Skipped: 0 test(s), Total: 9 test(s)
    Name: Tests.Digital Signatures Failed: 0 test(s), Passed: 8 test(s), Skipped: 0 test(s), Total: 8 test(s)
    Name: Tests.Exceptions Failed: 0 test(s), Passed: 28 test(s), Skipped: 0 test(s), Total: 28 test(s)
    Name: Tests.Files Failed: 0 test(s), Passed: 54 test(s), Skipped: 0 test(s), Total: 54 test(s)
    Name: Tests.Finalization Failed: 0 test(s), Passed: 1 test(s), Skipped: 0 test(s), Total: 1 test(s)
    Name: Tests.Localization Failed: 0 test(s), Passed: 1 test(s), Skipped: 0 test(s), Total: 1 test(s)
    Name: Tests.Monticello Failed: 0 test(s), Passed: 120 test(s), Skipped: 0 test(s), Total: 120 test(s)
    Name: Tests.Multilingual Failed: 0 test(s), Passed: 3 test(s), Skipped: 0 test(s), Total: 3 test(s)
    Name: Tests.Object Events Failed: 0 test(s), Passed: 24 test(s), Skipped: 0 test(s), Total: 24 test(s)
    Name: Tests.ObjectsAsMethods Failed: 0 test(s), Passed: 3 test(s), Skipped: 0 test(s), Total: 3 test(s)
    Name: Tests.PackageInfo Failed: 0 test(s), Passed: 1 test(s), Skipped: 0 test(s), Total: 1 test(s)
    Name: Tests.Polymorph.Widgets Failed: 0 test(s), Passed: 9 test(s), Skipped: 0 test(s), Total: 9 test(s)
    Name: Tests.Release Failed: 1 test(s), Passed: 2 test(s), Skipped: 0 test(s), Total: 3 test(s)
  • Failed: Tests.Release.ReleaseTest.testUndeclared
  • Name: Tests.ScriptLoader Failed: 0 test(s), Passed: 4 test(s), Skipped: 0 test(s), Total: 4 test(s)
    Name: Tests.System Failed: 0 test(s), Passed: 298 test(s), Skipped: 0 test(s), Total: 298 test(s)
    Name: Tests.SystemChangeNotification Failed: 0 test(s), Passed: 37 test(s), Skipped: 0 test(s), Total: 37 test(s)
    Name: Tests.SystemHistory Failed: 0 test(s), Passed: 14 test(s), Skipped: 0 test(s), Total: 14 test(s)
    Name: Tests.SystemSupport Failed: 0 test(s), Passed: 9 test(s), Skipped: 0 test(s), Total: 9 test(s)
    Name: Tests.TextEditors Failed: 0 test(s), Passed: 7 test(s), Skipped: 0 test(s), Total: 7 test(s)
    Name: Tests.Traits Failed: 0 test(s), Passed: 60 test(s), Skipped: 0 test(s), Total: 60 test(s)
    Name: Tests.Traits.MOP Failed: 0 test(s), Passed: 3 test(s), Skipped: 0 test(s), Total: 3 test(s)
    Name: Tests.VM Failed: 0 test(s), Passed: 10 test(s), Skipped: 0 test(s), Total: 10 test(s)
    Name: ToolsTest.Debugger Failed: 0 test(s), Passed: 10 test(s), Skipped: 0 test(s), Total: 10 test(s)
    Name: ToolsTest.Inspector Failed: 0 test(s), Passed: 1 test(s), Skipped: 0 test(s), Total: 1 test(s)
    Name: ToolsTest.MessageTally Failed: 0 test(s), Passed: 5 test(s), Skipped: 0 test(s), Total: 5 test(s)
    Name: ToolsTest.PointerFinder Failed: 0 test(s), Passed: 3 test(s), Skipped: 0 test(s), Total: 3 test(s)
    Name: Zinc.Tests Failed: 0 test(s), Passed: 206 test(s), Skipped: 0 test(s), Total: 206 test(s)

    Reply | Threaded
    Open this post in threaded view
    |  
    Report Content as Inappropriate

    Pharo 1.3 - Build # 30 - Failure!

    jenkins-pharo.ci.inria.fr
    BUILD FAILURE
    Build URLhttps://ci.lille.inria.fr/pharo/job/Pharo%201.3/30/
    Project:Pharo 1.3
    Date of build:Thu, 12 Apr 2012 17:48:50 +0200
    Build duration:1 min 6 sec

    CHANGES
    No Changes

    BUILD ARTIFACTS
  • Pharo-1.3/Pharo-1.3.changes
  • Pharo-1.3/Pharo-1.3.image
  • Pharo-1.3/Pharo-1.3.st

  • CONSOLE OUTPUT
    [...truncated 982 lines...]
    MethodContext(ContextPart)>>handleSignal:
    MethodContext(ContextPart)>>handleSignal:
    MethodContext(ContextPart)>>handleSignal:
    MethodContext(ContextPart)>>handleSignal:
    ------------------------------
    Process: a Process in Delay class>>handleTimerEvent
    stack:
    Delay class>>handleTimerEvent
    Delay class>>runTimerEventLoop
    [self runTimerEventLoop] in Delay class>>startTimerEventLoop
    [self value.
    Processor terminateActive] in BlockClosure>>newProcess
    ------------------------------
    Process: a Process in [self value.
    Processor terminateActive] in BlockClosure>>newProcess
    stack:
    [self value.
    Processor terminateActive] in BlockClosure>>newProcess
    ------------------------------
    Process: a Process in [self value.
    Processor terminateActive] in BlockClosure>>newProcess
    stack:
    [self value.
    Processor terminateActive] in BlockClosure>>newProcess
    ------------------------------
    Process: a Process in [self value.
    Processor terminateActive] in BlockClosure>>newProcess
    stack:
    [self value.
    Processor terminateActive] in BlockClosure>>newProcess
    ------------------------------
    Process: a Process in [self value.
    Processor terminateActive] in BlockClosure>>newProcess
    stack:
    [self value.
    Processor terminateActive] in BlockClosure>>newProcess
    ------------------------------
    Process: a Process in [delaySemaphore wait] in Delay>>wait
    stack:
    [delaySemaphore wait] in Delay>>wait
    BlockClosure>>ifCurtailed:
    Delay>>wait
    InputEventPollingFetcher>>waitForInput
    InputEventPollingFetcher(InputEventFetcher)>>eventLoop
    [self eventLoop] in InputEventPollingFetcher(InputEventFetcher)>>installEventLoop
    [self value.
    Processor terminateActive] in BlockClosure>>newProcess
    ------------------------------
    Process: a Process in SmalltalkImage>>lowSpaceWatcher
    stack:
    SmalltalkImage>>lowSpaceWatcher
    [self lowSpaceWatcher] in SmalltalkImage>>installLowSpaceWatcher
    [self value.
    Processor terminateActive] in BlockClosure>>newProcess
    ------------------------------
    Process: a Process in ProcessorScheduler class>>idleProcess
    stack:
    ProcessorScheduler class>>idleProcess
    [self idleProcess] in ProcessorScheduler class>>startUp
    [self value.
    Processor terminateActive] in BlockClosure>>newProcess
    ------------------------------
    Process: a Process in WeakArray class>>finalizationProcess
    stack:
    WeakArray class>>finalizationProcess
    [self finalizationProcess] in WeakArray class>>restartFinalizationProcess
    [self value.
    Processor terminateActive] in BlockClosure>>newProcess
    ------------------------------
    Process: a Process in Process>>terminate
    stack:
    Process>>terminate
    ------------------------------
    Build step 'Execute shell' marked build as failure
    Archiving artifacts
    Recording test results
    Email was triggered for: Failure
    Sending email for trigger: Failure

    Reply | Threaded
    Open this post in threaded view
    |  
    Report Content as Inappropriate

    Pharo 1.3 - Build # 31 - Still Failing!

    jenkins-pharo.ci.inria.fr
    BUILD FAILURE
    Build URLhttps://ci.lille.inria.fr/pharo/job/Pharo%201.3/31/
    Project:Pharo 1.3
    Date of build:Thu, 12 Apr 2012 17:53:53 +0200
    Build duration:1 min 34 sec

    CHANGES
    No Changes

    BUILD ARTIFACTS
  • Pharo-1.3/Pharo-1.3.changes
  • Pharo-1.3/Pharo-1.3.image
  • Pharo-1.3/Pharo-1.3.st

  • CONSOLE OUTPUT
    [...truncated 982 lines...]
    MethodContext(ContextPart)>>handleSignal:
    MethodContext(ContextPart)>>handleSignal:
    MethodContext(ContextPart)>>handleSignal:
    MethodContext(ContextPart)>>handleSignal:
    ------------------------------
    Process: a Process in Delay class>>handleTimerEvent
    stack:
    Delay class>>handleTimerEvent
    Delay class>>runTimerEventLoop
    [self runTimerEventLoop] in Delay class>>startTimerEventLoop
    [self value.
    Processor terminateActive] in BlockClosure>>newProcess
    ------------------------------
    Process: a Process in [self value.
    Processor terminateActive] in BlockClosure>>newProcess
    stack:
    [self value.
    Processor terminateActive] in BlockClosure>>newProcess
    ------------------------------
    Process: a Process in [self value.
    Processor terminateActive] in BlockClosure>>newProcess
    stack:
    [self value.
    Processor terminateActive] in BlockClosure>>newProcess
    ------------------------------
    Process: a Process in [self value.
    Processor terminateActive] in BlockClosure>>newProcess
    stack:
    [self value.
    Processor terminateActive] in BlockClosure>>newProcess
    ------------------------------
    Process: a Process in [self value.
    Processor terminateActive] in BlockClosure>>newProcess
    stack:
    [self value.
    Processor terminateActive] in BlockClosure>>newProcess
    ------------------------------
    Process: a Process in [delaySemaphore wait] in Delay>>wait
    stack:
    [delaySemaphore wait] in Delay>>wait
    BlockClosure>>ifCurtailed:
    Delay>>wait
    InputEventPollingFetcher>>waitForInput
    InputEventPollingFetcher(InputEventFetcher)>>eventLoop
    [self eventLoop] in InputEventPollingFetcher(InputEventFetcher)>>installEventLoop
    [self value.
    Processor terminateActive] in BlockClosure>>newProcess
    ------------------------------
    Process: a Process in SmalltalkImage>>lowSpaceWatcher
    stack:
    SmalltalkImage>>lowSpaceWatcher
    [self lowSpaceWatcher] in SmalltalkImage>>installLowSpaceWatcher
    [self value.
    Processor terminateActive] in BlockClosure>>newProcess
    ------------------------------
    Process: a Process in ProcessorScheduler class>>idleProcess
    stack:
    ProcessorScheduler class>>idleProcess
    [self idleProcess] in ProcessorScheduler class>>startUp
    [self value.
    Processor terminateActive] in BlockClosure>>newProcess
    ------------------------------
    Process: a Process in WeakArray class>>finalizationProcess
    stack:
    WeakArray class>>finalizationProcess
    [self finalizationProcess] in WeakArray class>>restartFinalizationProcess
    [self value.
    Processor terminateActive] in BlockClosure>>newProcess
    ------------------------------
    Process: a Process in Process>>terminate
    stack:
    Process>>terminate
    ------------------------------
    Build step 'Execute shell' marked build as failure
    Archiving artifacts
    Recording test results
    Email was triggered for: Failure
    Sending email for trigger: Failure

    Reply | Threaded
    Open this post in threaded view
    |  
    Report Content as Inappropriate

    Pharo 1.3 - Build # 32 - Still unstable!

    jenkins-pharo.ci.inria.fr
    BUILD UNSTABLE
    Build URLhttps://ci.lille.inria.fr/pharo/job/Pharo%201.3/32/
    Project:Pharo 1.3
    Date of build:Fri, 13 Apr 2012 09:05:22 +0200
    Build duration:21 min

    CHANGES
    No Changes

    BUILD ARTIFACTS
  • Pharo-1.3/Pharo-1.3.changes
  • Pharo-1.3/Pharo-1.3.image
  • Pharo-1.3/Pharo-1.3.st
  • Pharo-1.3-one-click.zip

  • JUnit Tests
    Name: AST.Tests.Core Failed: 0 test(s), Passed: 69 test(s), Skipped: 0 test(s), Total: 69 test(s)
    Name: AST.Tests.Semantic Failed: 0 test(s), Passed: 25 test(s), Skipped: 0 test(s), Total: 25 test(s)
    Name: Announcements.Tests.Core Failed: 0 test(s), Passed: 27 test(s), Skipped: 0 test(s), Total: 27 test(s)
    Name: AutomaticMethodCategorizer.Tests Failed: 0 test(s), Passed: 14 test(s), Skipped: 0 test(s), Total: 14 test(s)
    Name: AutomaticMethodCategorizerOB.Tests Failed: 0 test(s), Passed: 2 test(s), Skipped: 0 test(s), Total: 2 test(s)
    Name: Autotest.Tests.Core Failed: 0 test(s), Passed: 27 test(s), Skipped: 0 test(s), Total: 27 test(s)
    Name: Autotest.Tests.GUI Failed: 0 test(s), Passed: 1 test(s), Skipped: 0 test(s), Total: 1 test(s)
    Name: Balloon.Collections.Tests Failed: 0 test(s), Passed: 34 test(s), Skipped: 0 test(s), Total: 34 test(s)
    Name: CollectionsTests.Arrayed Failed: 0 test(s), Passed: 562 test(s), Skipped: 0 test(s), Total: 562 test(s)
    Name: CollectionsTests.Atomic Failed: 0 test(s), Passed: 12 test(s), Skipped: 0 test(s), Total: 12 test(s)
    Name: CollectionsTests.Sequenceable Failed: 0 test(s), Passed: 912 test(s), Skipped: 0 test(s), Total: 912 test(s)
    Name: CollectionsTests.SplitJoin Failed: 0 test(s), Passed: 27 test(s), Skipped: 0 test(s), Total: 27 test(s)
    Name: CollectionsTests.Stack Failed: 0 test(s), Passed: 16 test(s), Skipped: 0 test(s), Total: 16 test(s)
    Name: CollectionsTests.Streams Failed: 0 test(s), Passed: 25 test(s), Skipped: 0 test(s), Total: 25 test(s)
    Name: CollectionsTests.Strings Failed: 0 test(s), Passed: 590 test(s), Skipped: 0 test(s), Total: 590 test(s)
    Name: CollectionsTests.Support Failed: 0 test(s), Passed: 12 test(s), Skipped: 0 test(s), Total: 12 test(s)
    Name: CollectionsTests.Text Failed: 0 test(s), Passed: 40 test(s), Skipped: 0 test(s), Total: 40 test(s)
    Name: CollectionsTests.Unordered Failed: 0 test(s), Passed: 1977 test(s), Skipped: 0 test(s), Total: 1977 test(s)
    Name: CollectionsTests.Weak Failed: 0 test(s), Passed: 751 test(s), Skipped: 0 test(s), Total: 751 test(s)
    Name: CompilerTests Failed: 0 test(s), Passed: 30 test(s), Skipped: 0 test(s), Total: 30 test(s)
    Name: CompressionTests.Archive Failed: 0 test(s), Passed: 2 test(s), Skipped: 0 test(s), Total: 2 test(s)
    Name: Finder.Tests Failed: 0 test(s), Passed: 9 test(s), Skipped: 0 test(s), Total: 9 test(s)
    Name: FreeTypeTests.cache Failed: 0 test(s), Passed: 23 test(s), Skipped: 0 test(s), Total: 23 test(s)
    Name: Gofer.Tests Failed: 0 test(s), Passed: 45 test(s), Skipped: 0 test(s), Total: 45 test(s)
    Name: Graphics.Tests.Files Failed: 0 test(s), Passed: 47 test(s), Skipped: 0 test(s), Total: 47 test(s)
    Name: Graphics.Tests.Primitives Failed: 0 test(s), Passed: 57 test(s), Skipped: 0 test(s), Total: 57 test(s)
    Name: Graphics.Tests.Text Failed: 0 test(s), Passed: 2 test(s), Skipped: 0 test(s), Total: 2 test(s)
    Name: HelpSystem.Tests.Builders Failed: 0 test(s), Passed: 5 test(s), Skipped: 0 test(s), Total: 5 test(s)
    Name: HelpSystem.Tests.Core.Model Failed: 0 test(s), Passed: 4 test(s), Skipped: 0 test(s), Total: 4 test(s)
    Name: HelpSystem.Tests.Core.UI Failed: 0 test(s), Passed: 6 test(s), Skipped: 0 test(s), Total: 6 test(s)
    Name: HelpSystem.Tests.Core.Utilities Failed: 0 test(s), Passed: 2 test(s), Skipped: 0 test(s), Total: 2 test(s)
    Name: KernelTests.Chronology Failed: 0 test(s), Passed: 575 test(s), Skipped: 0 test(s), Total: 575 test(s)
    Name: KernelTests.Classes Failed: 0 test(s), Passed: 60 test(s), Skipped: 0 test(s), Total: 60 test(s)
    Name: KernelTests.Exception Failed: 0 test(s), Passed: 2 test(s), Skipped: 0 test(s), Total: 2 test(s)
    Name: KernelTests.Methods Failed: 0 test(s), Passed: 188 test(s), Skipped: 0 test(s), Total: 188 test(s)
    Name: KernelTests.Numbers Failed: 0 test(s), Passed: 220 test(s), Skipped: 0 test(s), Total: 220 test(s)
    Name: KernelTests.Objects Failed: 0 test(s), Passed: 84 test(s), Skipped: 0 test(s), Total: 84 test(s)
    Name: KernelTests.Pragmas Failed: 0 test(s), Passed: 3 test(s), Skipped: 0 test(s), Total: 3 test(s)
    Name: KernelTests.Processes Failed: 0 test(s), Passed: 22 test(s), Skipped: 0 test(s), Total: 22 test(s)
    Name: LED.Test Failed: 0 test(s), Passed: 2 test(s), Skipped: 0 test(s), Total: 2 test(s)
    Name: Metacello.TestsCore Failed: 0 test(s), Passed: 44 test(s), Skipped: 0 test(s), Total: 44 test(s)
    Name: Metacello.TestsMC Failed: 0 test(s), Passed: 303 test(s), Skipped: 0 test(s), Total: 303 test(s)
    Name: Metacello.TestsPlatform Failed: 0 test(s), Passed: 1 test(s), Skipped: 0 test(s), Total: 1 test(s)
    Name: Metacello.TestsProfStef Failed: 0 test(s), Passed: 1 test(s), Skipped: 0 test(s), Total: 1 test(s)
    Name: Metacello.TestsReference Failed: 0 test(s), Passed: 2 test(s), Skipped: 0 test(s), Total: 2 test(s)
    Name: Metacello.TestsTutorial Failed: 0 test(s), Passed: 32 test(s), Skipped: 0 test(s), Total: 32 test(s)
    Name: MethodWrappers.Tests Failed: 0 test(s), Passed: 2 test(s), Skipped: 0 test(s), Total: 2 test(s)
    Name: MorphicTests.Basic Failed: 0 test(s), Passed: 16 test(s), Skipped: 0 test(s), Total: 16 test(s)
    Name: MorphicTests.Kernel Failed: 0 test(s), Passed: 8 test(s), Skipped: 0 test(s), Total: 8 test(s)
    Name: MorphicTests.Text Support Failed: 0 test(s), Passed: 14 test(s), Skipped: 0 test(s), Total: 14 test(s)
    Name: MorphicTests.Widgets Failed: 0 test(s), Passed: 5 test(s), Skipped: 0 test(s), Total: 5 test(s)
    Name: MorphicTests.WindowNotification Failed: 0 test(s), Passed: 7 test(s), Skipped: 0 test(s), Total: 7 test(s)
    Name: Multilingual.Tests.TextConversion Failed: 0 test(s), Passed: 7 test(s), Skipped: 0 test(s), Total: 7 test(s)
    Name: NetworkTests.Kernel Failed: 0 test(s), Passed: 31 test(s), Skipped: 0 test(s), Total: 31 test(s)
    Name: NetworkTests.MailMessage Failed: 0 test(s), Passed: 2 test(s), Skipped: 0 test(s), Total: 2 test(s)
    Name: NetworkTests.Protocols Failed: 0 test(s), Passed: 3 test(s), Skipped: 0 test(s), Total: 3 test(s)
    Name: NetworkTests.RFC822 Failed: 0 test(s), Passed: 1 test(s), Skipped: 0 test(s), Total: 1 test(s)
    Name: NetworkTests.URI Failed: 0 test(s), Passed: 105 test(s), Skipped: 0 test(s), Total: 105 test(s)
    Name: NetworkTests.UUID Failed: 0 test(s), Passed: 11 test(s), Skipped: 0 test(s), Total: 11 test(s)
    Name: NetworkTests.Url Failed: 0 test(s), Passed: 42 test(s), Skipped: 0 test(s), Total: 42 test(s)
    Name: OB.Fake.Tests Failed: 0 test(s), Passed: 10 test(s), Skipped: 0 test(s), Total: 10 test(s)
    Name: OB.Tests.Core Failed: 0 test(s), Passed: 89 test(s), Skipped: 0 test(s), Total: 89 test(s)
    Name: OB.Tests.Morphic Failed: 0 test(s), Passed: 24 test(s), Skipped: 0 test(s), Total: 24 test(s)
    Name: OB.Tests.Standard Failed: 0 test(s), Passed: 647 test(s), Skipped: 0 test(s), Total: 647 test(s)
    Name: OcompletionTests Failed: 14 test(s), Passed: 64 test(s), Skipped: 0 test(s), Total: 78 test(s)
  • Failed: OcompletionTests.ECInstVarTypeGuesserTest.testComplexInit
  • Failed: OcompletionTests.ECInstVarTypeGuesserTest.testComplexInit2
  • Failed: OcompletionTests.ECInstVarTypeGuesserTest.testConstantArray
  • Failed: OcompletionTests.ECInstVarTypeGuesserTest.testConstantBoolean
  • Failed: OcompletionTests.ECInstVarTypeGuesserTest.testConstantInteger
  • Failed: OcompletionTests.ECInstVarTypeGuesserTest.testConstantIntegerNil
  • Failed: OcompletionTests.ECInstVarTypeGuesserTest.testConstantString
  • Failed: OcompletionTests.ECInstVarTypeGuesserTest.testConstantSymbol
  • Failed: OcompletionTests.ECInstVarTypeGuesserTest.testGlobalVarKeyword
  • Failed: OcompletionTests.ECInstVarTypeGuesserTest.testGlobalVarKeyword2
  • Failed: OcompletionTests.ECInstVarTypeGuesserTest.testMessageSend
  • Failed: OcompletionTests.ECInstVarTypeGuesserTest.testMessageSend2
  • Failed: OcompletionTests.ECInstVarTypeGuesserTest.testSuperWithAnotherInit
  • Failed: OcompletionTests.ECInstVarTypeGuesserTest.testTypeSuggestingParameter
  • Name: ProfStef.Tests Failed: 0 test(s), Passed: 47 test(s), Skipped: 0 test(s), Total: 47 test(s)
    Name: Refactoring.Tests.Changes Failed: 0 test(s), Passed: 43 test(s), Skipped: 0 test(s), Total: 43 test(s)
    Name: Refactoring.Tests.Core Failed: 0 test(s), Passed: 215 test(s), Skipped: 0 test(s), Total: 215 test(s)
    Name: Refactoring.Tests.Critics Failed: 0 test(s), Passed: 57 test(s), Skipped: 0 test(s), Total: 57 test(s)
    Name: Refactoring.Tests.Environment Failed: 0 test(s), Passed: 20 test(s), Skipped: 0 test(s), Total: 20 test(s)
    Name: Refactoring.Tests.Spelling Failed: 0 test(s), Passed: 16 test(s), Skipped: 0 test(s), Total: 16 test(s)
    Name: Regex.Tests.Core Failed: 0 test(s), Passed: 188 test(s), Skipped: 0 test(s), Total: 188 test(s)
    Name: RoelTyper.Tests Failed: 0 test(s), Passed: 72 test(s), Skipped: 0 test(s), Total: 72 test(s)
    Name: SUnit.Core.Extensions Failed: 0 test(s), Passed: 3 test(s), Skipped: 0 test(s), Total: 3 test(s)
    Name: SUnit.Core.Utilities Failed: 0 test(s), Passed: 3 test(s), Skipped: 0 test(s), Total: 3 test(s)
    Name: SUnit.Tests.Core Failed: 0 test(s), Passed: 77 test(s), Skipped: 0 test(s), Total: 77 test(s)
    Name: ShoutTests.Parsing Failed: 0 test(s), Passed: 5 test(s), Skipped: 0 test(s), Total: 5 test(s)
    Name: StratifiedProxy.Tests Failed: 0 test(s), Passed: 2 test(s), Skipped: 0 test(s), Total: 2 test(s)
    Name: Tests.Browser Failed: 0 test(s), Passed: 7 test(s), Skipped: 0 test(s), Total: 7 test(s)
    Name: Tests.Bugs Failed: 0 test(s), Passed: 60 test(s), Skipped: 0 test(s), Total: 60 test(s)
    Name: Tests.Compiler Failed: 0 test(s), Passed: 71 test(s), Skipped: 0 test(s), Total: 71 test(s)
    Name: Tests.Compression Failed: 0 test(s), Passed: 9 test(s), Skipped: 0 test(s), Total: 9 test(s)
    Name: Tests.Digital Signatures Failed: 0 test(s), Passed: 8 test(s), Skipped: 0 test(s), Total: 8 test(s)
    Name: Tests.Exceptions Failed: 0 test(s), Passed: 28 test(s), Skipped: 0 test(s), Total: 28 test(s)
    Name: Tests.Files Failed: 0 test(s), Passed: 54 test(s), Skipped: 0 test(s), Total: 54 test(s)
    Name: Tests.Finalization Failed: 0 test(s), Passed: 1 test(s), Skipped: 0 test(s), Total: 1 test(s)
    Name: Tests.Localization Failed: 0 test(s), Passed: 1 test(s), Skipped: 0 test(s), Total: 1 test(s)
    Name: Tests.Monticello Failed: 0 test(s), Passed: 120 test(s), Skipped: 0 test(s), Total: 120 test(s)
    Name: Tests.Multilingual Failed: 0 test(s), Passed: 3 test(s), Skipped: 0 test(s), Total: 3 test(s)
    Name: Tests.Object Events Failed: 0 test(s), Passed: 24 test(s), Skipped: 0 test(s), Total: 24 test(s)
    Name: Tests.ObjectsAsMethods Failed: 0 test(s), Passed: 3 test(s), Skipped: 0 test(s), Total: 3 test(s)
    Name: Tests.PackageInfo Failed: 0 test(s), Passed: 1 test(s), Skipped: 0 test(s), Total: 1 test(s)
    Name: Tests.Polymorph.Widgets Failed: 0 test(s), Passed: 9 test(s), Skipped: 0 test(s), Total: 9 test(s)
    Name: Tests.Release Failed: 1 test(s), Passed: 2 test(s), Skipped: 0 test(s), Total: 3 test(s)
  • Failed: Tests.Release.ReleaseTest.testUndeclared
  • Name: Tests.ScriptLoader Failed: 0 test(s), Passed: 4 test(s), Skipped: 0 test(s), Total: 4 test(s)
    Name: Tests.System Failed: 0 test(s), Passed: 298 test(s), Skipped: 0 test(s), Total: 298 test(s)
    Name: Tests.SystemChangeNotification Failed: 0 test(s), Passed: 37 test(s), Skipped: 0 test(s), Total: 37 test(s)
    Name: Tests.SystemHistory Failed: 0 test(s), Passed: 14 test(s), Skipped: 0 test(s), Total: 14 test(s)
    Name: Tests.SystemSupport Failed: 0 test(s), Passed: 9 test(s), Skipped: 0 test(s), Total: 9 test(s)
    Name: Tests.TextEditors Failed: 0 test(s), Passed: 7 test(s), Skipped: 0 test(s), Total: 7 test(s)
    Name: Tests.Traits Failed: 0 test(s), Passed: 60 test(s), Skipped: 0 test(s), Total: 60 test(s)
    Name: Tests.Traits.MOP Failed: 0 test(s), Passed: 3 test(s), Skipped: 0 test(s), Total: 3 test(s)
    Name: Tests.VM Failed: 0 test(s), Passed: 10 test(s), Skipped: 0 test(s), Total: 10 test(s)
    Name: ToolsTest.Debugger Failed: 0 test(s), Passed: 10 test(s), Skipped: 0 test(s), Total: 10 test(s)
    Name: ToolsTest.Inspector Failed: 0 test(s), Passed: 1 test(s), Skipped: 0 test(s), Total: 1 test(s)
    Name: ToolsTest.MessageTally Failed: 0 test(s), Passed: 5 test(s), Skipped: 0 test(s), Total: 5 test(s)
    Name: ToolsTest.PointerFinder Failed: 0 test(s), Passed: 3 test(s), Skipped: 0 test(s), Total: 3 test(s)
    Name: Zinc.Tests Failed: 0 test(s), Passed: 206 test(s), Skipped: 0 test(s), Total: 206 test(s)

    Reply | Threaded
    Open this post in threaded view
    |  
    Report Content as Inappropriate

    Pharo 1.3 - Build # 33 - Still Unstable!

    jenkins-pharo.ci.inria.fr
    BUILD UNSTABLE
    Build URLhttps://ci.lille.inria.fr/pharo/job/Pharo%201.3/33/
    Project:Pharo 1.3
    Date of build:Fri, 13 Apr 2012 13:53:38 +0200
    Build duration:21 min

    CHANGES
    No Changes

    BUILD ARTIFACTS
  • Pharo-1.3/Pharo-1.3.changes
  • Pharo-1.3/Pharo-1.3.image
  • Pharo-1.3/Pharo-1.3.st
  • Pharo-1.3-one-click.zip
  • Pharo-1.3.zip

  • JUnit Tests
    Name: AST.Tests.Core Failed: 0 test(s), Passed: 69 test(s), Skipped: 0 test(s), Total: 69 test(s)
    Name: AST.Tests.Semantic Failed: 0 test(s), Passed: 25 test(s), Skipped: 0 test(s), Total: 25 test(s)
    Name: Announcements.Tests.Core Failed: 0 test(s), Passed: 27 test(s), Skipped: 0 test(s), Total: 27 test(s)
    Name: AutomaticMethodCategorizer.Tests Failed: 0 test(s), Passed: 14 test(s), Skipped: 0 test(s), Total: 14 test(s)
    Name: AutomaticMethodCategorizerOB.Tests Failed: 0 test(s), Passed: 2 test(s), Skipped: 0 test(s), Total: 2 test(s)
    Name: Autotest.Tests.Core Failed: 0 test(s), Passed: 27 test(s), Skipped: 0 test(s), Total: 27 test(s)
    Name: Autotest.Tests.GUI Failed: 0 test(s), Passed: 1 test(s), Skipped: 0 test(s), Total: 1 test(s)
    Name: Balloon.Collections.Tests Failed: 0 test(s), Passed: 34 test(s), Skipped: 0 test(s), Total: 34 test(s)
    Name: CollectionsTests.Arrayed Failed: 0 test(s), Passed: 562 test(s), Skipped: 0 test(s), Total: 562 test(s)
    Name: CollectionsTests.Atomic Failed: 0 test(s), Passed: 12 test(s), Skipped: 0 test(s), Total: 12 test(s)
    Name: CollectionsTests.Sequenceable Failed: 0 test(s), Passed: 912 test(s), Skipped: 0 test(s), Total: 912 test(s)
    Name: CollectionsTests.SplitJoin Failed: 0 test(s), Passed: 27 test(s), Skipped: 0 test(s), Total: 27 test(s)
    Name: CollectionsTests.Stack Failed: 0 test(s), Passed: 16 test(s), Skipped: 0 test(s), Total: 16 test(s)
    Name: CollectionsTests.Streams Failed: 0 test(s), Passed: 25 test(s), Skipped: 0 test(s), Total: 25 test(s)
    Name: CollectionsTests.Strings Failed: 0 test(s), Passed: 590 test(s), Skipped: 0 test(s), Total: 590 test(s)
    Name: CollectionsTests.Support Failed: 0 test(s), Passed: 12 test(s), Skipped: 0 test(s), Total: 12 test(s)
    Name: CollectionsTests.Text Failed: 0 test(s), Passed: 40 test(s), Skipped: 0 test(s), Total: 40 test(s)
    Name: CollectionsTests.Unordered Failed: 0 test(s), Passed: 1977 test(s), Skipped: 0 test(s), Total: 1977 test(s)
    Name: CollectionsTests.Weak Failed: 0 test(s), Passed: 751 test(s), Skipped: 0 test(s), Total: 751 test(s)
    Name: CompilerTests Failed: 0 test(s), Passed: 30 test(s), Skipped: 0 test(s), Total: 30 test(s)
    Name: CompressionTests.Archive Failed: 0 test(s), Passed: 2 test(s), Skipped: 0 test(s), Total: 2 test(s)
    Name: Finder.Tests Failed: 0 test(s), Passed: 9 test(s), Skipped: 0 test(s), Total: 9 test(s)
    Name: FreeTypeTests.cache Failed: 0 test(s), Passed: 23 test(s), Skipped: 0 test(s), Total: 23 test(s)
    Name: Gofer.Tests Failed: 0 test(s), Passed: 45 test(s), Skipped: 0 test(s), Total: 45 test(s)
    Name: Graphics.Tests.Files Failed: 0 test(s), Passed: 47 test(s), Skipped: 0 test(s), Total: 47 test(s)
    Name: Graphics.Tests.Primitives Failed: 0 test(s), Passed: 57 test(s), Skipped: 0 test(s), Total: 57 test(s)
    Name: Graphics.Tests.Text Failed: 0 test(s), Passed: 2 test(s), Skipped: 0 test(s), Total: 2 test(s)
    Name: HelpSystem.Tests.Builders Failed: 0 test(s), Passed: 5 test(s), Skipped: 0 test(s), Total: 5 test(s)
    Name: HelpSystem.Tests.Core.Model Failed: 0 test(s), Passed: 4 test(s), Skipped: 0 test(s), Total: 4 test(s)
    Name: HelpSystem.Tests.Core.UI Failed: 0 test(s), Passed: 6 test(s), Skipped: 0 test(s), Total: 6 test(s)
    Name: HelpSystem.Tests.Core.Utilities Failed: 0 test(s), Passed: 2 test(s), Skipped: 0 test(s), Total: 2 test(s)
    Name: KernelTests.Chronology Failed: 0 test(s), Passed: 575 test(s), Skipped: 0 test(s), Total: 575 test(s)
    Name: KernelTests.Classes Failed: 0 test(s), Passed: 60 test(s), Skipped: 0 test(s), Total: 60 test(s)
    Name: KernelTests.Exception Failed: 0 test(s), Passed: 2 test(s), Skipped: 0 test(s), Total: 2 test(s)
    Name: KernelTests.Methods Failed: 0 test(s), Passed: 188 test(s), Skipped: 0 test(s), Total: 188 test(s)
    Name: KernelTests.Numbers Failed: 0 test(s), Passed: 220 test(s), Skipped: 0 test(s), Total: 220 test(s)
    Name: KernelTests.Objects Failed: 0 test(s), Passed: 84 test(s), Skipped: 0 test(s), Total: 84 test(s)
    Name: KernelTests.Pragmas Failed: 0 test(s), Passed: 3 test(s), Skipped: 0 test(s), Total: 3 test(s)
    Name: KernelTests.Processes Failed: 0 test(s), Passed: 22 test(s), Skipped: 0 test(s), Total: 22 test(s)
    Name: LED.Test Failed: 0 test(s), Passed: 2 test(s), Skipped: 0 test(s), Total: 2 test(s)
    Name: Metacello.TestsCore Failed: 0 test(s), Passed: 44 test(s), Skipped: 0 test(s), Total: 44 test(s)
    Name: Metacello.TestsMC Failed: 0 test(s), Passed: 303 test(s), Skipped: 0 test(s), Total: 303 test(s)
    Name: Metacello.TestsPlatform Failed: 0 test(s), Passed: 1 test(s), Skipped: 0 test(s), Total: 1 test(s)
    Name: Metacello.TestsProfStef Failed: 0 test(s), Passed: 1 test(s), Skipped: 0 test(s), Total: 1 test(s)
    Name: Metacello.TestsReference Failed: 0 test(s), Passed: 2 test(s), Skipped: 0 test(s), Total: 2 test(s)
    Name: Metacello.TestsTutorial Failed: 0 test(s), Passed: 32 test(s), Skipped: 0 test(s), Total: 32 test(s)
    Name: MethodWrappers.Tests Failed: 0 test(s), Passed: 2 test(s), Skipped: 0 test(s), Total: 2 test(s)
    Name: MorphicTests.Basic Failed: 0 test(s), Passed: 16 test(s), Skipped: 0 test(s), Total: 16 test(s)
    Name: MorphicTests.Kernel Failed: 0 test(s), Passed: 8 test(s), Skipped: 0 test(s), Total: 8 test(s)
    Name: MorphicTests.Text Support Failed: 0 test(s), Passed: 14 test(s), Skipped: 0 test(s), Total: 14 test(s)
    Name: MorphicTests.Widgets Failed: 0 test(s), Passed: 5 test(s), Skipped: 0 test(s), Total: 5 test(s)
    Name: MorphicTests.WindowNotification Failed: 0 test(s), Passed: 7 test(s), Skipped: 0 test(s), Total: 7 test(s)
    Name: Multilingual.Tests.TextConversion Failed: 0 test(s), Passed: 7 test(s), Skipped: 0 test(s), Total: 7 test(s)
    Name: NetworkTests.Kernel Failed: 0 test(s), Passed: 31 test(s), Skipped: 0 test(s), Total: 31 test(s)
    Name: NetworkTests.MailMessage Failed: 0 test(s), Passed: 2 test(s), Skipped: 0 test(s), Total: 2 test(s)
    Name: NetworkTests.Protocols Failed: 0 test(s), Passed: 3 test(s), Skipped: 0 test(s), Total: 3 test(s)
    Name: NetworkTests.RFC822 Failed: 0 test(s), Passed: 1 test(s), Skipped: 0 test(s), Total: 1 test(s)
    Name: NetworkTests.URI Failed: 0 test(s), Passed: 105 test(s), Skipped: 0 test(s), Total: 105 test(s)
    Name: NetworkTests.UUID Failed: 0 test(s), Passed: 11 test(s), Skipped: 0 test(s), Total: 11 test(s)
    Name: NetworkTests.Url Failed: 0 test(s), Passed: 42 test(s), Skipped: 0 test(s), Total: 42 test(s)
    Name: OB.Fake.Tests Failed: 0 test(s), Passed: 10 test(s), Skipped: 0 test(s), Total: 10 test(s)
    Name: OB.Tests.Core Failed: 0 test(s), Passed: 89 test(s), Skipped: 0 test(s), Total: 89 test(s)
    Name: OB.Tests.Morphic Failed: 0 test(s), Passed: 24 test(s), Skipped: 0 test(s), Total: 24 test(s)
    Name: OB.Tests.Standard Failed: 0 test(s), Passed: 647 test(s), Skipped: 0 test(s), Total: 647 test(s)
    Name: OcompletionTests Failed: 14 test(s), Passed: 64 test(s), Skipped: 0 test(s), Total: 78 test(s)
  • Failed: OcompletionTests.ECInstVarTypeGuesserTest.testComplexInit
  • Failed: OcompletionTests.ECInstVarTypeGuesserTest.testComplexInit2
  • Failed: OcompletionTests.ECInstVarTypeGuesserTest.testConstantArray
  • Failed: OcompletionTests.ECInstVarTypeGuesserTest.testConstantBoolean
  • Failed: OcompletionTests.ECInstVarTypeGuesserTest.testConstantInteger
  • Failed: OcompletionTests.ECInstVarTypeGuesserTest.testConstantIntegerNil
  • Failed: OcompletionTests.ECInstVarTypeGuesserTest.testConstantString
  • Failed: OcompletionTests.ECInstVarTypeGuesserTest.testConstantSymbol
  • Failed: OcompletionTests.ECInstVarTypeGuesserTest.testGlobalVarKeyword
  • Failed: OcompletionTests.ECInstVarTypeGuesserTest.testGlobalVarKeyword2
  • Failed: OcompletionTests.ECInstVarTypeGuesserTest.testMessageSend
  • Failed: OcompletionTests.ECInstVarTypeGuesserTest.testMessageSend2
  • Failed: OcompletionTests.ECInstVarTypeGuesserTest.testSuperWithAnotherInit
  • Failed: OcompletionTests.ECInstVarTypeGuesserTest.testTypeSuggestingParameter
  • Name: ProfStef.Tests Failed: 0 test(s), Passed: 47 test(s), Skipped: 0 test(s), Total: 47 test(s)
    Name: Refactoring.Tests.Changes Failed: 0 test(s), Passed: 43 test(s), Skipped: 0 test(s), Total: 43 test(s)
    Name: Refactoring.Tests.Core Failed: 0 test(s), Passed: 215 test(s), Skipped: 0 test(s), Total: 215 test(s)
    Name: Refactoring.Tests.Critics Failed: 0 test(s), Passed: 57 test(s), Skipped: 0 test(s), Total: 57 test(s)
    Name: Refactoring.Tests.Environment Failed: 0 test(s), Passed: 20 test(s), Skipped: 0 test(s), Total: 20 test(s)
    Name: Refactoring.Tests.Spelling Failed: 0 test(s), Passed: 16 test(s), Skipped: 0 test(s), Total: 16 test(s)
    Name: Regex.Tests.Core Failed: 0 test(s), Passed: 188 test(s), Skipped: 0 test(s), Total: 188 test(s)
    Name: RoelTyper.Tests Failed: 0 test(s), Passed: 72 test(s), Skipped: 0 test(s), Total: 72 test(s)
    Name: SUnit.Core.Extensions Failed: 0 test(s), Passed: 3 test(s), Skipped: 0 test(s), Total: 3 test(s)
    Name: SUnit.Core.Utilities Failed: 0 test(s), Passed: 3 test(s), Skipped: 0 test(s), Total: 3 test(s)
    Name: SUnit.Tests.Core Failed: 0 test(s), Passed: 77 test(s), Skipped: 0 test(s), Total: 77 test(s)
    Name: ShoutTests.Parsing Failed: 0 test(s), Passed: 5 test(s), Skipped: 0 test(s), Total: 5 test(s)
    Name: StratifiedProxy.Tests Failed: 0 test(s), Passed: 2 test(s), Skipped: 0 test(s), Total: 2 test(s)
    Name: Tests.Browser Failed: 0 test(s), Passed: 7 test(s), Skipped: 0 test(s), Total: 7 test(s)
    Name: Tests.Bugs Failed: 0 test(s), Passed: 60 test(s), Skipped: 0 test(s), Total: 60 test(s)
    Name: Tests.Compiler Failed: 0 test(s), Passed: 71 test(s), Skipped: 0 test(s), Total: 71 test(s)
    Name: Tests.Compression Failed: 0 test(s), Passed: 9 test(s), Skipped: 0 test(s), Total: 9 test(s)
    Name: Tests.Digital Signatures Failed: 0 test(s), Passed: 8 test(s), Skipped: 0 test(s), Total: 8 test(s)
    Name: Tests.Exceptions Failed: 0 test(s), Passed: 28 test(s), Skipped: 0 test(s), Total: 28 test(s)
    Name: Tests.Files Failed: 0 test(s), Passed: 54 test(s), Skipped: 0 test(s), Total: 54 test(s)
    Name: Tests.Finalization Failed: 0 test(s), Passed: 1 test(s), Skipped: 0 test(s), Total: 1 test(s)
    Name: Tests.Localization Failed: 0 test(s), Passed: 1 test(s), Skipped: 0 test(s), Total: 1 test(s)
    Name: Tests.Monticello Failed: 0 test(s), Passed: 120 test(s), Skipped: 0 test(s), Total: 120 test(s)
    Name: Tests.Multilingual Failed: 0 test(s), Passed: 3 test(s), Skipped: 0 test(s), Total: 3 test(s)
    Name: Tests.Object Events Failed: 0 test(s), Passed: 24 test(s), Skipped: 0 test(s), Total: 24 test(s)
    Name: Tests.ObjectsAsMethods Failed: 0 test(s), Passed: 3 test(s), Skipped: 0 test(s), Total: 3 test(s)
    Name: Tests.PackageInfo Failed: 0 test(s), Passed: 1 test(s), Skipped: 0 test(s), Total: 1 test(s)
    Name: Tests.Polymorph.Widgets Failed: 0 test(s), Passed: 9 test(s), Skipped: 0 test(s), Total: 9 test(s)
    Name: Tests.Release Failed: 1 test(s), Passed: 2 test(s), Skipped: 0 test(s), Total: 3 test(s)
  • Failed: Tests.Release.ReleaseTest.testUndeclared
  • Name: Tests.ScriptLoader Failed: 0 test(s), Passed: 4 test(s), Skipped: 0 test(s), Total: 4 test(s)
    Name: Tests.System Failed: 0 test(s), Passed: 298 test(s), Skipped: 0 test(s), Total: 298 test(s)
    Name: Tests.SystemChangeNotification Failed: 0 test(s), Passed: 37 test(s), Skipped: 0 test(s), Total: 37 test(s)
    Name: Tests.SystemHistory Failed: 0 test(s), Passed: 14 test(s), Skipped: 0 test(s), Total: 14 test(s)
    Name: Tests.SystemSupport Failed: 0 test(s), Passed: 9 test(s), Skipped: 0 test(s), Total: 9 test(s)
    Name: Tests.TextEditors Failed: 0 test(s), Passed: 7 test(s), Skipped: 0 test(s), Total: 7 test(s)
    Name: Tests.Traits Failed: 0 test(s), Passed: 60 test(s), Skipped: 0 test(s), Total: 60 test(s)
    Name: Tests.Traits.MOP Failed: 0 test(s), Passed: 3 test(s), Skipped: 0 test(s), Total: 3 test(s)
    Name: Tests.VM Failed: 0 test(s), Passed: 10 test(s), Skipped: 0 test(s), Total: 10 test(s)
    Name: ToolsTest.Debugger Failed: 0 test(s), Passed: 10 test(s), Skipped: 0 test(s), Total: 10 test(s)
    Name: ToolsTest.Inspector Failed: 0 test(s), Passed: 1 test(s), Skipped: 0 test(s), Total: 1 test(s)
    Name: ToolsTest.MessageTally Failed: 0 test(s), Passed: 5 test(s), Skipped: 0 test(s), Total: 5 test(s)
    Name: ToolsTest.PointerFinder Failed: 0 test(s), Passed: 3 test(s), Skipped: 0 test(s), Total: 3 test(s)
    Name: Zinc.Tests Failed: 0 test(s), Passed: 206 test(s), Skipped: 0 test(s), Total: 206 test(s)

    Loading...